hadoop-yarn-issues mailing list archives

Site index · List index
Message view « Date » · « Thread »
Top « Date » · « Thread »
From "Hudson (JIRA)" <j...@apache.org>
Subject [jira] [Commented] (YARN-6141) ppc64le on Linux doesn't trigger __linux get_executable codepath
Date Tue, 24 Apr 2018 20:51:10 GMT

    [ https://issues.apache.org/jira/browse/YARN-6141?page=com.atlassian.jira.plugin.system.issuetabpanels:comment-tabpanel&focusedCommentId=16450784#comment-16450784
] 

Hudson commented on YARN-6141:
------------------------------

SUCCESS: Integrated in Jenkins build Hadoop-trunk-Commit #14057 (See [https://builds.apache.org/job/Hadoop-trunk-Commit/14057/])
YARN-6141. ppc64le on Linux doesn't trigger __linux get_executable (xyao: rev 70fac5d1d53983c59516afd410e0b066a46c1232)
* (edit) hadoop-yarn-project/hadoop-yarn/hadoop-yarn-server/hadoop-yarn-server-nodemanager/src/main/native/container-executor/impl/get_executable.c


> ppc64le on Linux doesn't trigger __linux get_executable codepath
> ----------------------------------------------------------------
>
>                 Key: YARN-6141
>                 URL: https://issues.apache.org/jira/browse/YARN-6141
>             Project: Hadoop YARN
>          Issue Type: Bug
>          Components: nodemanager
>    Affects Versions: 3.0.0-alpha4
>         Environment: $ uname -a
> Linux f8eef0f055cf 3.16.0-30-generic #40~14.04.1-Ubuntu SMP Thu Jan 15 17:42:36 UTC 2015
ppc64le ppc64le ppc64le GNU/Linux
>            Reporter: Sonia Garudi
>            Assignee: Ayappan
>            Priority: Major
>              Labels: ppc64le
>             Fix For: 2.9.0, 3.0.0-alpha4, 2.8.2
>
>         Attachments: YARN-6141.patch
>
>
> On ppc64le architecture, the build fails in the 'Hadoop YARN NodeManager' project with
the below error:
> Cannot safely determine executable path with a relative HADOOP_CONF_DIR on this operating
system.
> [WARNING]  #error Cannot safely determine executable path with a relative HADOOP_CONF_DIR
on this operating system.
> [WARNING]   ^
> [WARNING] make[2]: *** [CMakeFiles/container.dir/main/native/container-executor/impl/get_executable.c.o]
Error 1
> [WARNING] make[2]: *** Waiting for unfinished jobs....
> [WARNING] make[1]: *** [CMakeFiles/container.dir/all] Error 2
> [WARNING] make: *** [all] Error 2
> [INFO] ------------------------------------------------------------------------
> [INFO] BUILD FAILURE
> [INFO] ------------------------------------------------------------------------
> Cmake version used :
> $ /usr/bin/cmake --version
> cmake version 2.8.12.2



--
This message was sent by Atlassian JIRA
(v7.6.3#76005)

---------------------------------------------------------------------
To unsubscribe, e-mail: yarn-issues-unsubscribe@hadoop.apache.org
For additional commands, e-mail: yarn-issues-help@hadoop.apache.org


Mime
View raw message