hadoop-yarn-issues mailing list archives

Site index · List index
Message view « Date » · « Thread »
Top « Date » · « Thread »
From "genericqa (JIRA)" <j...@apache.org>
Subject [jira] [Commented] (YARN-7849) TestMiniYarnClusterNodeUtilization#testUpdateNodeUtilization fails due to heartbeat sync error
Date Wed, 31 Jan 2018 19:44:00 GMT

    [ https://issues.apache.org/jira/browse/YARN-7849?page=com.atlassian.jira.plugin.system.issuetabpanels:comment-tabpanel&focusedCommentId=16347486#comment-16347486
] 

genericqa commented on YARN-7849:
---------------------------------

| (/) *{color:green}+1 overall{color}* |
\\
\\
|| Vote || Subsystem || Runtime || Comment ||
| {color:blue}0{color} | {color:blue} reexec {color} | {color:blue} 17m 13s{color} | {color:blue}
Docker mode activated. {color} |
|| || || || {color:brown} Prechecks {color} ||
| {color:green}+1{color} | {color:green} @author {color} | {color:green}  0m  0s{color} |
{color:green} The patch does not contain any @author tags. {color} |
| {color:green}+1{color} | {color:green} test4tests {color} | {color:green}  0m  0s{color}
| {color:green} The patch appears to include 2 new or modified test files. {color} |
|| || || || {color:brown} branch-2.8 Compile Tests {color} ||
| {color:green}+1{color} | {color:green} mvninstall {color} | {color:green}  8m 57s{color}
| {color:green} branch-2.8 passed {color} |
| {color:green}+1{color} | {color:green} compile {color} | {color:green}  0m 21s{color} |
{color:green} branch-2.8 passed {color} |
| {color:green}+1{color} | {color:green} checkstyle {color} | {color:green}  0m 14s{color}
| {color:green} branch-2.8 passed {color} |
| {color:green}+1{color} | {color:green} mvnsite {color} | {color:green}  0m 26s{color} |
{color:green} branch-2.8 passed {color} |
| {color:blue}0{color} | {color:blue} findbugs {color} | {color:blue}  0m  0s{color} | {color:blue}
Skipped patched modules with no Java source: hadoop-yarn-project/hadoop-yarn/hadoop-yarn-server/hadoop-yarn-server-tests
{color} |
| {color:green}+1{color} | {color:green} findbugs {color} | {color:green}  0m  0s{color} |
{color:green} branch-2.8 passed {color} |
| {color:green}+1{color} | {color:green} javadoc {color} | {color:green}  0m 15s{color} |
{color:green} branch-2.8 passed {color} |
|| || || || {color:brown} Patch Compile Tests {color} ||
| {color:green}+1{color} | {color:green} mvninstall {color} | {color:green}  0m 19s{color}
| {color:green} the patch passed {color} |
| {color:green}+1{color} | {color:green} compile {color} | {color:green}  0m 18s{color} |
{color:green} the patch passed {color} |
| {color:green}+1{color} | {color:green} javac {color} | {color:green}  0m 18s{color} | {color:green}
the patch passed {color} |
| {color:green}+1{color} | {color:green} checkstyle {color} | {color:green}  0m 10s{color}
| {color:green} the patch passed {color} |
| {color:green}+1{color} | {color:green} mvnsite {color} | {color:green}  0m 23s{color} |
{color:green} the patch passed {color} |
| {color:green}+1{color} | {color:green} whitespace {color} | {color:green}  0m  0s{color}
| {color:green} The patch has no whitespace issues. {color} |
| {color:blue}0{color} | {color:blue} findbugs {color} | {color:blue}  0m  0s{color} | {color:blue}
Skipped patched modules with no Java source: hadoop-yarn-project/hadoop-yarn/hadoop-yarn-server/hadoop-yarn-server-tests
{color} |
| {color:green}+1{color} | {color:green} findbugs {color} | {color:green}  0m  0s{color} |
{color:green} the patch passed {color} |
| {color:green}+1{color} | {color:green} javadoc {color} | {color:green}  0m 11s{color} |
{color:green} the patch passed {color} |
|| || || || {color:brown} Other Tests {color} ||
| {color:green}+1{color} | {color:green} unit {color} | {color:green}  2m 28s{color} | {color:green}
hadoop-yarn-server-tests in the patch passed. {color} |
| {color:green}+1{color} | {color:green} asflicense {color} | {color:green}  0m 20s{color}
| {color:green} The patch does not generate ASF License warnings. {color} |
| {color:black}{color} | {color:black} {color} | {color:black} 32m 16s{color} | {color:black}
{color} |
\\
\\
|| Subsystem || Report/Notes ||
| Docker | Client=17.05.0-ce Server=17.05.0-ce Image:yetus/hadoop:c2d96dd |
| JIRA Issue | YARN-7849 |
| JIRA Patch URL | https://issues.apache.org/jira/secure/attachment/12908629/YARN-7849-branch-2.8.v1.patch
|
| Optional Tests |  asflicense  compile  javac  javadoc  mvninstall  mvnsite  unit  shadedclient
 findbugs  checkstyle  |
| uname | Linux a92222388c9a 3.13.0-135-generic #184-Ubuntu SMP Wed Oct 18 11:55:51 UTC 2017
x86_64 x86_64 x86_64 GNU/Linux |
| Build tool | maven |
| Personality | /testptch/patchprocess/precommit/personality/provided.sh |
| git revision | branch-2.8 / d9132bf |
| maven | version: Apache Maven 3.0.5 |
| Default Java | 1.7.0_151 |
|  Test Results | https://builds.apache.org/job/PreCommit-YARN-Build/19553/testReport/ |
| Max. process+thread count | 548 (vs. ulimit of 5000) |
| modules | C: hadoop-yarn-project/hadoop-yarn/hadoop-yarn-server/hadoop-yarn-server-tests
U: hadoop-yarn-project/hadoop-yarn/hadoop-yarn-server/hadoop-yarn-server-tests |
| Console output | https://builds.apache.org/job/PreCommit-YARN-Build/19553/console |
| Powered by | Apache Yetus 0.8.0-SNAPSHOT   http://yetus.apache.org |


This message was automatically generated.



> TestMiniYarnClusterNodeUtilization#testUpdateNodeUtilization fails due to heartbeat sync
error
> ----------------------------------------------------------------------------------------------
>
>                 Key: YARN-7849
>                 URL: https://issues.apache.org/jira/browse/YARN-7849
>             Project: Hadoop YARN
>          Issue Type: Bug
>          Components: test
>    Affects Versions: 3.1.0, 2.9.1, 3.0.1, 2.8.4
>            Reporter: Jason Lowe
>            Assignee: Botong Huang
>            Priority: Major
>         Attachments: YARN-7849-branch-2.8.v1.patch, YARN-7849.v1.patch
>
>
> testUpdateNodeUtilization is failing.  From a branch-2.8 run:
> {noformat}
> Tests run: 1, Failures: 1, Errors: 0, Skipped: 0, Time elapsed: 13.013 sec <<<
FAILURE! - in org.apache.hadoop.yarn.server.TestMiniYarnClusterNodeUtilization
> testUpdateNodeUtilization(org.apache.hadoop.yarn.server.TestMiniYarnClusterNodeUtilization)
 Time elapsed: 12.961 sec  <<< FAILURE!
> java.lang.AssertionError: Containers Utillization not propagated to RMNode expected:<<pmem:1024,
vmem:2048, vCores:11.0>> but was:<null>
> 	at org.junit.Assert.fail(Assert.java:88)
> 	at org.junit.Assert.failNotEquals(Assert.java:743)
> 	at org.junit.Assert.assertEquals(Assert.java:118)
> 	at org.apache.hadoop.yarn.server.TestMiniYarnClusterNodeUtilization.verifySimulatedUtilization(TestMiniYarnClusterNodeUtilization.java:227)
> 	at org.apache.hadoop.yarn.server.TestMiniYarnClusterNodeUtilization.testUpdateNodeUtilization(TestMiniYarnClusterNodeUtilization.java:116)
> {noformat}



--
This message was sent by Atlassian JIRA
(v7.6.3#76005)

---------------------------------------------------------------------
To unsubscribe, e-mail: yarn-issues-unsubscribe@hadoop.apache.org
For additional commands, e-mail: yarn-issues-help@hadoop.apache.org


Mime
View raw message