hadoop-yarn-issues mailing list archives

Site index · List index
Message view « Date » · « Thread »
Top « Date » · « Thread »
From "Miklos Szegedi (JIRA)" <j...@apache.org>
Subject [jira] [Created] (YARN-7734) YARN-5418 breaks TestContainerLogsPage.testContainerLogPageAccess
Date Thu, 11 Jan 2018 04:15:00 GMT
Miklos Szegedi created YARN-7734:
------------------------------------

             Summary: YARN-5418 breaks TestContainerLogsPage.testContainerLogPageAccess
                 Key: YARN-7734
                 URL: https://issues.apache.org/jira/browse/YARN-7734
             Project: Hadoop YARN
          Issue Type: Bug
            Reporter: Miklos Szegedi
            Assignee: Xuan Gong


It adds a call to LogAggregationFileControllerFactory where the context is not filled in with
the configuration in the mock in the unit test.
{code}
[ERROR] Tests run: 5, Failures: 0, Errors: 1, Skipped: 0, Time elapsed: 1.492 s <<<
FAILURE! - in org.apache.hadoop.yarn.server.nodemanager.webapp.TestContainerLogsPage
[ERROR] testContainerLogPageAccess(org.apache.hadoop.yarn.server.nodemanager.webapp.TestContainerLogsPage)
 Time elapsed: 0.208 s  <<< ERROR!
java.lang.NullPointerException
	at org.apache.hadoop.yarn.logaggregation.filecontroller.LogAggregationFileControllerFactory.<init>(LogAggregationFileControllerFactory.java:68)
	at org.apache.hadoop.yarn.server.nodemanager.webapp.ContainerLogsPage$ContainersLogsBlock.<init>(ContainerLogsPage.java:100)
	at org.apache.hadoop.yarn.server.nodemanager.webapp.TestContainerLogsPage.testContainerLogPageAccess(TestContainerLogsPage.java:268)
	at sun.reflect.NativeMethodAccessorImpl.invoke0(Native Method)
	at sun.reflect.NativeMethodAccessorImpl.invoke(NativeMethodAccessorImpl.java:62)
	at sun.reflect.DelegatingMethodAccessorImpl.invoke(DelegatingMethodAccessorImpl.java:43)
	at java.lang.reflect.Method.invoke(Method.java:498)
	at org.junit.runners.model.FrameworkMethod$1.runReflectiveCall(FrameworkMethod.java:47)
	at org.junit.internal.runners.model.ReflectiveCallable.run(ReflectiveCallable.java:12)
	at org.junit.runners.model.FrameworkMethod.invokeExplosively(FrameworkMethod.java:44)
	at org.junit.internal.runners.statements.InvokeMethod.evaluate(InvokeMethod.java:17)
	at org.junit.internal.runners.statements.FailOnTimeout$StatementThread.run(FailOnTimeout.java:74)
{code}




--
This message was sent by Atlassian JIRA
(v6.4.14#64029)

---------------------------------------------------------------------
To unsubscribe, e-mail: yarn-issues-unsubscribe@hadoop.apache.org
For additional commands, e-mail: yarn-issues-help@hadoop.apache.org


Mime
View raw message