hadoop-yarn-issues mailing list archives

Site index · List index
Message view « Date » · « Thread »
Top « Date » · « Thread »
From "Hudson (JIRA)" <j...@apache.org>
Subject [jira] [Commented] (YARN-7629) TestContainerLaunch# fails after YARN-7381
Date Sat, 16 Dec 2017 00:09:22 GMT

    [ https://issues.apache.org/jira/browse/YARN-7629?page=com.atlassian.jira.plugin.system.issuetabpanels:comment-tabpanel&focusedCommentId=16293433#comment-16293433
] 

Hudson commented on YARN-7629:
------------------------------

SUCCESS: Integrated in Jenkins build Hadoop-trunk-Commit #13390 (See [https://builds.apache.org/job/Hadoop-trunk-Commit/13390/])
YARN-7629. TestContainerLaunch# fails after YARN-7381. (Jason Lowe via (wangda: rev 44825f096068dfc17fe4dcfb7db3d775b08fa7a0)
* (edit) hadoop-yarn-project/hadoop-yarn/hadoop-yarn-server/hadoop-yarn-server-nodemanager/src/test/java/org/apache/hadoop/yarn/server/nodemanager/containermanager/launcher/TestContainerLaunch.java


> TestContainerLaunch# fails after YARN-7381
> ------------------------------------------
>
>                 Key: YARN-7629
>                 URL: https://issues.apache.org/jira/browse/YARN-7629
>             Project: Hadoop YARN
>          Issue Type: Bug
>    Affects Versions: 3.0.0
>            Reporter: Jason Lowe
>            Assignee: Jason Lowe
>             Fix For: 3.1.0, 3.0.1
>
>         Attachments: YARN-7629.001.patch
>
>
> TestContainerLaunch#testValidEnvVariableSubstitution is failing:
> {noformat}
> [INFO] Running org.apache.hadoop.yarn.server.nodemanager.containermanager.launcher.TestContainerLaunch
> [ERROR] Tests run: 1, Failures: 1, Errors: 0, Skipped: 0, Time elapsed: 0.824 s <<<
FAILURE! - in org.apache.hadoop.yarn.server.nodemanager.containermanager.launcher.TestContainerLaunch
> [ERROR] testValidEnvVariableSubstitution(org.apache.hadoop.yarn.server.nodemanager.containermanager.launcher.TestContainerLaunch)
 Time elapsed: 0.322 s  <<< FAILURE!
> java.lang.AssertionError: Should not catch exception
> 	at org.junit.Assert.fail(Assert.java:88)
> 	at org.apache.hadoop.yarn.server.nodemanager.containermanager.launcher.TestContainerLaunch.testValidEnvVariableSubstitution(TestContainerLaunch.java:1813)
> 	at sun.reflect.NativeMethodAccessorImpl.invoke0(Native Method)
> 	at sun.reflect.NativeMethodAccessorImpl.invoke(NativeMethodAccessorImpl.java:62)
> 	at sun.reflect.DelegatingMethodAccessorImpl.invoke(DelegatingMethodAccessorImpl.java:43)
> 	at java.lang.reflect.Method.invoke(Method.java:497)
> 	at org.junit.runners.model.FrameworkMethod$1.runReflectiveCall(FrameworkMethod.java:47)
> 	at org.junit.internal.runners.model.ReflectiveCallable.run(ReflectiveCallable.java:12)
> 	at org.junit.runners.model.FrameworkMethod.invokeExplosively(FrameworkMethod.java:44)
> 	at org.junit.internal.runners.statements.InvokeMethod.evaluate(InvokeMethod.java:17)
> 	at org.junit.internal.runners.statements.RunBefores.evaluate(RunBefores.java:26)
> 	at org.junit.internal.runners.statements.RunAfters.evaluate(RunAfters.java:27)
> 	at org.junit.runners.ParentRunner.runLeaf(ParentRunner.java:271)
> 	at org.junit.runners.BlockJUnit4ClassRunner.runChild(BlockJUnit4ClassRunner.java:70)
> 	at org.junit.runners.BlockJUnit4ClassRunner.runChild(BlockJUnit4ClassRunner.java:50)
> 	at org.junit.runners.ParentRunner$3.run(ParentRunner.java:238)
> 	at org.junit.runners.ParentRunner$1.schedule(ParentRunner.java:63)
> 	at org.junit.runners.ParentRunner.runChildren(ParentRunner.java:236)
> 	at org.junit.runners.ParentRunner.access$000(ParentRunner.java:53)
> 	at org.junit.runners.ParentRunner$2.evaluate(ParentRunner.java:229)
> 	at org.junit.runners.ParentRunner.run(ParentRunner.java:309)
> 	at org.apache.maven.surefire.junit4.JUnit4Provider.execute(JUnit4Provider.java:369)
> 	at org.apache.maven.surefire.junit4.JUnit4Provider.executeWithRerun(JUnit4Provider.java:275)
> 	at org.apache.maven.surefire.junit4.JUnit4Provider.executeTestSet(JUnit4Provider.java:239)
> 	at org.apache.maven.surefire.junit4.JUnit4Provider.invoke(JUnit4Provider.java:160)
> 	at org.apache.maven.surefire.booter.ForkedBooter.invokeProviderInSameClassLoader(ForkedBooter.java:373)
> 	at org.apache.maven.surefire.booter.ForkedBooter.runSuitesInProcess(ForkedBooter.java:334)
> 	at org.apache.maven.surefire.booter.ForkedBooter.execute(ForkedBooter.java:119)
> 	at org.apache.maven.surefire.booter.ForkedBooter.main(ForkedBooter.java:407)
> {noformat}



--
This message was sent by Atlassian JIRA
(v6.4.14#64029)

---------------------------------------------------------------------
To unsubscribe, e-mail: yarn-issues-unsubscribe@hadoop.apache.org
For additional commands, e-mail: yarn-issues-help@hadoop.apache.org


Mime
View raw message