hadoop-yarn-issues mailing list archives

Site index · List index
Message view « Date » · « Thread »
Top « Date » · « Thread »
From "Hadoop QA (JIRA)" <j...@apache.org>
Subject [jira] [Commented] (YARN-7299) TestDistributedScheduler is failing
Date Sat, 28 Oct 2017 02:16:00 GMT

    [ https://issues.apache.org/jira/browse/YARN-7299?page=com.atlassian.jira.plugin.system.issuetabpanels:comment-tabpanel&focusedCommentId=16223153#comment-16223153
] 

Hadoop QA commented on YARN-7299:
---------------------------------

| (x) *{color:red}-1 overall{color}* |
\\
\\
|| Vote || Subsystem || Runtime || Comment ||
| {color:blue}0{color} | {color:blue} reexec {color} | {color:blue}  0m 26s{color} | {color:blue}
Docker mode activated. {color} |
|| || || || {color:brown} Prechecks {color} ||
| {color:green}+1{color} | {color:green} @author {color} | {color:green}  0m  0s{color} |
{color:green} The patch does not contain any @author tags. {color} |
| {color:green}+1{color} | {color:green} test4tests {color} | {color:green}  0m  0s{color}
| {color:green} The patch appears to include 1 new or modified test files. {color} |
|| || || || {color:brown} trunk Compile Tests {color} ||
| {color:green}+1{color} | {color:green} mvninstall {color} | {color:green} 14m 11s{color}
| {color:green} trunk passed {color} |
| {color:green}+1{color} | {color:green} compile {color} | {color:green}  0m 50s{color} |
{color:green} trunk passed {color} |
| {color:green}+1{color} | {color:green} checkstyle {color} | {color:green}  0m 18s{color}
| {color:green} trunk passed {color} |
| {color:green}+1{color} | {color:green} mvnsite {color} | {color:green}  0m 33s{color} |
{color:green} trunk passed {color} |
| {color:green}+1{color} | {color:green} shadedclient {color} | {color:green}  8m 43s{color}
| {color:green} branch has no errors when building and testing our client artifacts. {color}
|
| {color:green}+1{color} | {color:green} findbugs {color} | {color:green}  0m 54s{color} |
{color:green} trunk passed {color} |
| {color:green}+1{color} | {color:green} javadoc {color} | {color:green}  0m 19s{color} |
{color:green} trunk passed {color} |
|| || || || {color:brown} Patch Compile Tests {color} ||
| {color:green}+1{color} | {color:green} mvninstall {color} | {color:green}  0m 30s{color}
| {color:green} the patch passed {color} |
| {color:green}+1{color} | {color:green} compile {color} | {color:green}  0m 49s{color} |
{color:green} the patch passed {color} |
| {color:green}+1{color} | {color:green} javac {color} | {color:green}  0m 49s{color} | {color:green}
the patch passed {color} |
| {color:green}+1{color} | {color:green} checkstyle {color} | {color:green}  0m 17s{color}
| {color:green} the patch passed {color} |
| {color:green}+1{color} | {color:green} mvnsite {color} | {color:green}  0m 32s{color} |
{color:green} the patch passed {color} |
| {color:green}+1{color} | {color:green} whitespace {color} | {color:green}  0m  0s{color}
| {color:green} The patch has no whitespace issues. {color} |
| {color:green}+1{color} | {color:green} shadedclient {color} | {color:green}  9m 16s{color}
| {color:green} patch has no errors when building and testing our client artifacts. {color}
|
| {color:green}+1{color} | {color:green} findbugs {color} | {color:green}  1m  3s{color} |
{color:green} the patch passed {color} |
| {color:green}+1{color} | {color:green} javadoc {color} | {color:green}  0m 19s{color} |
{color:green} the patch passed {color} |
|| || || || {color:brown} Other Tests {color} ||
| {color:red}-1{color} | {color:red} unit {color} | {color:red} 17m  2s{color} | {color:red}
hadoop-yarn-server-nodemanager in the patch failed. {color} |
| {color:red}-1{color} | {color:red} asflicense {color} | {color:red}  0m 17s{color} | {color:red}
The patch generated 3 ASF License warnings. {color} |
| {color:black}{color} | {color:black} {color} | {color:black} 56m 15s{color} | {color:black}
{color} |
\\
\\
|| Reason || Tests ||
| Failed junit tests | TEST-cetest |
\\
\\
|| Subsystem || Report/Notes ||
| Docker | Client=17.05.0-ce Server=17.05.0-ce Image:yetus/hadoop:5b98639 |
| JIRA Issue | YARN-7299 |
| JIRA Patch URL | https://issues.apache.org/jira/secure/attachment/12894479/YARN-7299.001.patch
|
| Optional Tests |  asflicense  compile  javac  javadoc  mvninstall  mvnsite  unit  shadedclient
 findbugs  checkstyle  |
| uname | Linux 6859a389e977 4.4.0-43-generic #63-Ubuntu SMP Wed Oct 12 13:48:03 UTC 2016
x86_64 x86_64 x86_64 GNU/Linux |
| Build tool | maven |
| Personality | /testptch/patchprocess/precommit/personality/provided.sh |
| git revision | trunk / 8be5707 |
| maven | version: Apache Maven 3.3.9 |
| Default Java | 1.8.0_131 |
| findbugs | v3.1.0-RC1 |
| unit | https://builds.apache.org/job/PreCommit-YARN-Build/18213/artifact/out/patch-unit-hadoop-yarn-project_hadoop-yarn_hadoop-yarn-server_hadoop-yarn-server-nodemanager.txt
|
|  Test Results | https://builds.apache.org/job/PreCommit-YARN-Build/18213/testReport/ |
| asflicense | https://builds.apache.org/job/PreCommit-YARN-Build/18213/artifact/out/patch-asflicense-problems.txt
|
| modules | C: hadoop-yarn-project/hadoop-yarn/hadoop-yarn-server/hadoop-yarn-server-nodemanager
U: hadoop-yarn-project/hadoop-yarn/hadoop-yarn-server/hadoop-yarn-server-nodemanager |
| Console output | https://builds.apache.org/job/PreCommit-YARN-Build/18213/console |
| Powered by | Apache Yetus 0.6.0-SNAPSHOT   http://yetus.apache.org |


This message was automatically generated.



> TestDistributedScheduler is failing
> -----------------------------------
>
>                 Key: YARN-7299
>                 URL: https://issues.apache.org/jira/browse/YARN-7299
>             Project: Hadoop YARN
>          Issue Type: Bug
>            Reporter: Jason Lowe
>            Assignee: Arun Suresh
>         Attachments: YARN-7299.001.patch
>
>
> TestDistributedScheduler has been failing consistently in trunk:
> {noformat}
> Running org.apache.hadoop.yarn.server.nodemanager.scheduler.TestDistributedScheduler
> Tests run: 1, Failures: 1, Errors: 0, Skipped: 0, Time elapsed: 0.75 sec <<<
FAILURE! - in org.apache.hadoop.yarn.server.nodemanager.scheduler.TestDistributedScheduler
> testDistributedScheduler(org.apache.hadoop.yarn.server.nodemanager.scheduler.TestDistributedScheduler)
 Time elapsed: 0.67 sec  <<< FAILURE!
> java.lang.AssertionError: expected:<4> but was:<2>
> 	at org.junit.Assert.fail(Assert.java:88)
> 	at org.junit.Assert.failNotEquals(Assert.java:743)
> 	at org.junit.Assert.assertEquals(Assert.java:118)
> 	at org.junit.Assert.assertEquals(Assert.java:555)
> 	at org.junit.Assert.assertEquals(Assert.java:542)
> 	at org.apache.hadoop.yarn.server.nodemanager.scheduler.TestDistributedScheduler.testDistributedScheduler(TestDistributedScheduler.java:118)
> {noformat}



--
This message was sent by Atlassian JIRA
(v6.4.14#64029)

---------------------------------------------------------------------
To unsubscribe, e-mail: yarn-issues-unsubscribe@hadoop.apache.org
For additional commands, e-mail: yarn-issues-help@hadoop.apache.org


Mime
View raw message