hadoop-yarn-issues mailing list archives

Site index · List index
Message view « Date » · « Thread »
Top « Date » · « Thread »
From "Akira Ajisaka (JIRA)" <j...@apache.org>
Subject [jira] [Updated] (YARN-7082) TestContainerManagerSecurity failing in trunk
Date Tue, 10 Oct 2017 06:03:00 GMT

     [ https://issues.apache.org/jira/browse/YARN-7082?page=com.atlassian.jira.plugin.system.issuetabpanels:all-tabpanel
]

Akira Ajisaka updated YARN-7082:
--------------------------------
    Description: 
{noformat}
Running org.apache.hadoop.yarn.server.TestContainerManagerSecurity
Tests run: 2, Failures: 0, Errors: 2, Skipped: 0, Time elapsed: 58.536 sec <<< FAILURE!
- in org.apache.hadoop.yarn.server.TestContainerManagerSecurity
testContainerManager[Simple](org.apache.hadoop.yarn.server.TestContainerManagerSecurity) 
Time elapsed: 31.537 sec  <<< ERROR!
java.lang.NullPointerException: null
	at org.apache.hadoop.yarn.security.ContainerTokenIdentifier.getUser(ContainerTokenIdentifier.java:265)
	at org.apache.hadoop.yarn.server.security.BaseContainerTokenSecretManager.createPassword(BaseContainerTokenSecretManager.java:90)
	at org.apache.hadoop.yarn.server.TestContainerManagerSecurity.testContainerToken(TestContainerManagerSecurity.java:678)
	at org.apache.hadoop.yarn.server.TestContainerManagerSecurity.testContainerManager(TestContainerManagerSecurity.java:170)

testContainerManager[Secure](org.apache.hadoop.yarn.server.TestContainerManagerSecurity) 
Time elapsed: 26.779 sec  <<< ERROR!
java.lang.NullPointerException: null
	at org.apache.hadoop.yarn.security.ContainerTokenIdentifier.getUser(ContainerTokenIdentifier.java:265)
	at org.apache.hadoop.yarn.server.security.BaseContainerTokenSecretManager.createPassword(BaseContainerTokenSecretManager.java:90)
	at org.apache.hadoop.yarn.server.TestContainerManagerSecurity.testContainerToken(TestContainerManagerSecurity.java:678)
	at org.apache.hadoop.yarn.server.TestContainerManagerSecurity.testContainerManager(TestContainerManagerSecurity.java:170)
{noformat}

  was:
{noformat}
Tests run: 2, Failures: 0, Errors: 2, Skipped: 0, Time elapsed: 247.899 sec <<< FAILURE!
- in org.apache.hadoop.yarn.server.TestContainerManagerSecurity
testContainerManager[0](org.apache.hadoop.yarn.server.TestContainerManagerSecurity)  Time
elapsed: 125.026 sec  <<< ERROR!
java.lang.Exception: test timed out after 120000 milliseconds
	at java.lang.Thread.sleep(Native Method)
	at org.apache.hadoop.io.retry.RetryInvocationHandler$Call.processWaitTimeAndRetryInfo(RetryInvocationHandler.java:130)
	at org.apache.hadoop.io.retry.RetryInvocationHandler$Call.invokeOnce(RetryInvocationHandler.java:107)
	at org.apache.hadoop.io.retry.RetryInvocationHandler.invoke(RetryInvocationHandler.java:348)
	at com.sun.proxy.$Proxy91.startContainers(Unknown Source)
	at org.apache.hadoop.yarn.server.TestContainerManagerSecurity.startContainer(TestContainerManagerSecurity.java:557)
	at org.apache.hadoop.yarn.server.TestContainerManagerSecurity.testStartContainer(TestContainerManagerSecurity.java:478)
	at org.apache.hadoop.yarn.server.TestContainerManagerSecurity.testNMTokens(TestContainerManagerSecurity.java:253)
	at org.apache.hadoop.yarn.server.TestContainerManagerSecurity.testContainerManager(TestContainerManagerSecurity.java:158)

testContainerManager[1](org.apache.hadoop.yarn.server.TestContainerManagerSecurity)  Time
elapsed: 122.535 sec  <<< ERROR!
java.lang.Exception: test timed out after 120000 milliseconds
	at java.lang.Thread.sleep(Native Method)
	at org.apache.hadoop.io.retry.RetryInvocationHandler$Call.processWaitTimeAndRetryInfo(RetryInvocationHandler.java:130)
	at org.apache.hadoop.io.retry.RetryInvocationHandler$Call.invokeOnce(RetryInvocationHandler.java:107)
	at org.apache.hadoop.io.retry.RetryInvocationHandler.invoke(RetryInvocationHandler.java:348)
	at com.sun.proxy.$Proxy91.startContainers(Unknown Source)
	at org.apache.hadoop.yarn.server.TestContainerManagerSecurity.startContainer(TestContainerManagerSecurity.java:557)
	at org.apache.hadoop.yarn.server.TestContainerManagerSecurity.testStartContainer(TestContainerManagerSecurity.java:478)
	at org.apache.hadoop.yarn.server.TestContainerManagerSecurity.testNMTokens(TestContainerManagerSecurity.java:253)
	at org.apache.hadoop.yarn.server.TestContainerManagerSecurity.testContainerManager(TestContainerManagerSecurity.java:158)

        at java.util.concurrent.ScheduledThreadPoolExecutor$DelayedW
{noformat}


Now the tests fail by NPE.

> TestContainerManagerSecurity failing in trunk
> ---------------------------------------------
>
>                 Key: YARN-7082
>                 URL: https://issues.apache.org/jira/browse/YARN-7082
>             Project: Hadoop YARN
>          Issue Type: Bug
>            Reporter: Varun Saxena
>
> {noformat}
> Running org.apache.hadoop.yarn.server.TestContainerManagerSecurity
> Tests run: 2, Failures: 0, Errors: 2, Skipped: 0, Time elapsed: 58.536 sec <<<
FAILURE! - in org.apache.hadoop.yarn.server.TestContainerManagerSecurity
> testContainerManager[Simple](org.apache.hadoop.yarn.server.TestContainerManagerSecurity)
 Time elapsed: 31.537 sec  <<< ERROR!
> java.lang.NullPointerException: null
> 	at org.apache.hadoop.yarn.security.ContainerTokenIdentifier.getUser(ContainerTokenIdentifier.java:265)
> 	at org.apache.hadoop.yarn.server.security.BaseContainerTokenSecretManager.createPassword(BaseContainerTokenSecretManager.java:90)
> 	at org.apache.hadoop.yarn.server.TestContainerManagerSecurity.testContainerToken(TestContainerManagerSecurity.java:678)
> 	at org.apache.hadoop.yarn.server.TestContainerManagerSecurity.testContainerManager(TestContainerManagerSecurity.java:170)
> testContainerManager[Secure](org.apache.hadoop.yarn.server.TestContainerManagerSecurity)
 Time elapsed: 26.779 sec  <<< ERROR!
> java.lang.NullPointerException: null
> 	at org.apache.hadoop.yarn.security.ContainerTokenIdentifier.getUser(ContainerTokenIdentifier.java:265)
> 	at org.apache.hadoop.yarn.server.security.BaseContainerTokenSecretManager.createPassword(BaseContainerTokenSecretManager.java:90)
> 	at org.apache.hadoop.yarn.server.TestContainerManagerSecurity.testContainerToken(TestContainerManagerSecurity.java:678)
> 	at org.apache.hadoop.yarn.server.TestContainerManagerSecurity.testContainerManager(TestContainerManagerSecurity.java:170)
> {noformat}



--
This message was sent by Atlassian JIRA
(v6.4.14#64029)

---------------------------------------------------------------------
To unsubscribe, e-mail: yarn-issues-unsubscribe@hadoop.apache.org
For additional commands, e-mail: yarn-issues-help@hadoop.apache.org


Mime
View raw message