hadoop-yarn-issues mailing list archives

Site index · List index
Message view « Date » · « Thread »
Top « Date » · « Thread »
From "Hadoop QA (JIRA)" <j...@apache.org>
Subject [jira] [Commented] (YARN-7260) yarn.router.pipeline.cache-max-size is missing in yarn-default.xml
Date Wed, 27 Sep 2017 16:17:00 GMT

    [ https://issues.apache.org/jira/browse/YARN-7260?page=com.atlassian.jira.plugin.system.issuetabpanels:comment-tabpanel&focusedCommentId=16182820#comment-16182820
] 

Hadoop QA commented on YARN-7260:
---------------------------------

| (x) *{color:red}-1 overall{color}* |
\\
\\
|| Vote || Subsystem || Runtime || Comment ||
| {color:blue}0{color} | {color:blue} reexec {color} | {color:blue}  0m  0s{color} | {color:blue}
Docker mode activated. {color} |
| {color:red}-1{color} | {color:red} docker {color} | {color:red}  8m 29s{color} | {color:red}
Docker failed to build yetus/hadoop:eaf5c66. {color} |
\\
\\
|| Subsystem || Report/Notes ||
| JIRA Issue | YARN-7260 |
| JIRA Patch URL | https://issues.apache.org/jira/secure/attachment/12889289/YARN-7260-branch-2.001.patch
|
| Console output | https://builds.apache.org/job/PreCommit-YARN-Build/17663/console |
| Powered by | Apache Yetus 0.6.0-SNAPSHOT   http://yetus.apache.org |


This message was automatically generated.



> yarn.router.pipeline.cache-max-size is missing in yarn-default.xml
> ------------------------------------------------------------------
>
>                 Key: YARN-7260
>                 URL: https://issues.apache.org/jira/browse/YARN-7260
>             Project: Hadoop YARN
>          Issue Type: Bug
>    Affects Versions: 2.9.0
>            Reporter: Rohith Sharma K S
>            Assignee: Jason Lowe
>         Attachments: YARN-7260-branch-2.001.patch
>
>
> In branch-2 TestYarnConfigurationFields fails
> {code}
> Running org.apache.hadoop.yarn.api.records.TestURL Tests run: 1, Failures: 0, Errors:
0, Skipped: 0, Time elapsed: 0.278 sec - in org.apache.hadoop.yarn.api.records.TestURL Running
org.apache.hadoop.yarn.conf.TestYarnConfigurationFields Tests run: 4, Failures: 2, Errors:
0, Skipped: 0, Time elapsed: 0.539 sec <<< FAILURE! - in org.apache.hadoop.yarn.conf.TestYarnConfigurationFields
testCompareXmlAgainstConfigurationClass(org.apache.hadoop.yarn.conf.TestYarnConfigurationFields)
Time elapsed: 0.296 sec <<< FAILURE! java.lang.AssertionError: yarn-default.xml has
1 properties missing in class org.apache.hadoop.yarn.conf.YarnConfiguration at org.junit.Assert.fail(Assert.java:88)
at org.junit.Assert.assertTrue(Assert.java:41) at org.apache.hadoop.conf.TestConfigurationFieldsBase.testCompareXmlAgainstConfigurationClass(TestConfigurationFieldsBase.java:588)

> {code}



--
This message was sent by Atlassian JIRA
(v6.4.14#64029)

---------------------------------------------------------------------
To unsubscribe, e-mail: yarn-issues-unsubscribe@hadoop.apache.org
For additional commands, e-mail: yarn-issues-help@hadoop.apache.org


Mime
View raw message