hadoop-yarn-issues mailing list archives

Site index · List index
Message view « Date » · « Thread »
Top « Date » · « Thread »
From "Hadoop QA (JIRA)" <j...@apache.org>
Subject [jira] [Commented] (YARN-7187) branch-2 native compilation broken in hadoop-yarn-server-nodemanager
Date Wed, 13 Sep 2017 12:44:02 GMT

    [ https://issues.apache.org/jira/browse/YARN-7187?page=com.atlassian.jira.plugin.system.issuetabpanels:comment-tabpanel&focusedCommentId=16164586#comment-16164586
] 

Hadoop QA commented on YARN-7187:
---------------------------------

| (x) *{color:red}-1 overall{color}* |
\\
\\
|| Vote || Subsystem || Runtime || Comment ||
| {color:blue}0{color} | {color:blue} reexec {color} | {color:blue} 16m 44s{color} | {color:blue}
Docker mode activated. {color} |
|| || || || {color:brown} Prechecks {color} ||
| {color:green}+1{color} | {color:green} @author {color} | {color:green}  0m  0s{color} |
{color:green} The patch does not contain any @author tags. {color} |
| {color:red}-1{color} | {color:red} test4tests {color} | {color:red}  0m  0s{color} | {color:red}
The patch doesn't appear to include any new or modified tests. Please justify why no new tests
are needed for this patch. Also please list what manual steps were performed to verify this
patch. {color} |
|| || || || {color:brown} branch-2 Compile Tests {color} ||
| {color:green}+1{color} | {color:green} mvninstall {color} | {color:green}  8m 44s{color}
| {color:green} branch-2 passed {color} |
| {color:red}-1{color} | {color:red} compile {color} | {color:red}  0m 18s{color} | {color:red}
hadoop-yarn-server-nodemanager in branch-2 failed. {color} |
| {color:green}+1{color} | {color:green} mvnsite {color} | {color:green}  0m 29s{color} |
{color:green} branch-2 passed {color} |
|| || || || {color:brown} Patch Compile Tests {color} ||
| {color:green}+1{color} | {color:green} mvninstall {color} | {color:green}  0m 23s{color}
| {color:green} the patch passed {color} |
| {color:green}+1{color} | {color:green} compile {color} | {color:green}  0m 25s{color} |
{color:green} the patch passed {color} |
| {color:red}-1{color} | {color:red} cc {color} | {color:red}  0m 25s{color} | {color:red}
hadoop-yarn-project_hadoop-yarn_hadoop-yarn-server_hadoop-yarn-server-nodemanager generated
1 new + 1 unchanged - 2 fixed = 2 total (was 3) {color} |
| {color:red}-1{color} | {color:red} javac {color} | {color:red}  0m 25s{color} | {color:red}
hadoop-yarn-project_hadoop-yarn_hadoop-yarn-server_hadoop-yarn-server-nodemanager generated
11 new + 14 unchanged - 0 fixed = 25 total (was 14) {color} |
| {color:green}+1{color} | {color:green} mvnsite {color} | {color:green}  0m 25s{color} |
{color:green} the patch passed {color} |
| {color:green}+1{color} | {color:green} whitespace {color} | {color:green}  0m  0s{color}
| {color:green} The patch has no whitespace issues. {color} |
|| || || || {color:brown} Other Tests {color} ||
| {color:red}-1{color} | {color:red} unit {color} | {color:red} 14m  5s{color} | {color:red}
hadoop-yarn-server-nodemanager in the patch failed. {color} |
| {color:green}+1{color} | {color:green} asflicense {color} | {color:green}  0m 18s{color}
| {color:green} The patch does not generate ASF License warnings. {color} |
| {color:black}{color} | {color:black} {color} | {color:black} 42m 19s{color} | {color:black}
{color} |
\\
\\
|| Reason || Tests ||
| Failed junit tests | hadoop.yarn.server.nodemanager.containermanager.TestContainerManager
|
\\
\\
|| Subsystem || Report/Notes ||
| Docker |  Image:yetus/hadoop:eaf5c66 |
| JIRA Issue | YARN-7187 |
| JIRA Patch URL | https://issues.apache.org/jira/secure/attachment/12886855/YARN-7187-branch-2.01.patch
|
| Optional Tests |  asflicense  compile  cc  mvnsite  javac  unit  |
| uname | Linux 76477ae25d3f 4.4.0-43-generic #63-Ubuntu SMP Wed Oct 12 13:48:03 UTC 2016
x86_64 x86_64 x86_64 GNU/Linux |
| Build tool | maven |
| Personality | /testptch/hadoop/patchprocess/precommit/personality/provided.sh |
| git revision | branch-2 / 055bde9 |
| Default Java | 1.7.0_151 |
| compile | https://builds.apache.org/job/PreCommit-YARN-Build/17437/artifact/patchprocess/branch-compile-hadoop-yarn-project_hadoop-yarn_hadoop-yarn-server_hadoop-yarn-server-nodemanager.txt
|
| cc | https://builds.apache.org/job/PreCommit-YARN-Build/17437/artifact/patchprocess/diff-compile-cc-hadoop-yarn-project_hadoop-yarn_hadoop-yarn-server_hadoop-yarn-server-nodemanager.txt
|
| javac | https://builds.apache.org/job/PreCommit-YARN-Build/17437/artifact/patchprocess/diff-compile-javac-hadoop-yarn-project_hadoop-yarn_hadoop-yarn-server_hadoop-yarn-server-nodemanager.txt
|
| unit | https://builds.apache.org/job/PreCommit-YARN-Build/17437/artifact/patchprocess/patch-unit-hadoop-yarn-project_hadoop-yarn_hadoop-yarn-server_hadoop-yarn-server-nodemanager.txt
|
|  Test Results | https://builds.apache.org/job/PreCommit-YARN-Build/17437/testReport/ |
| modules | C: hadoop-yarn-project/hadoop-yarn/hadoop-yarn-server/hadoop-yarn-server-nodemanager
U: hadoop-yarn-project/hadoop-yarn/hadoop-yarn-server/hadoop-yarn-server-nodemanager |
| Console output | https://builds.apache.org/job/PreCommit-YARN-Build/17437/console |
| Powered by | Apache Yetus 0.6.0-SNAPSHOT   http://yetus.apache.org |


This message was automatically generated.



> branch-2 native compilation broken in hadoop-yarn-server-nodemanager
> --------------------------------------------------------------------
>
>                 Key: YARN-7187
>                 URL: https://issues.apache.org/jira/browse/YARN-7187
>             Project: Hadoop YARN
>          Issue Type: Bug
>            Reporter: Varun Saxena
>            Priority: Blocker
>         Attachments: YARN-7187-branch-2.01.patch, YARN-7187-branch-2.patch
>
>
> {noformat}
> [WARNING] make[2]: Leaving directory `/home/root1/Projects/Branch2/hadoop-yarn-project/hadoop-yarn/hadoop-yarn-server/hadoop-yarn-server-nodemanager/target/native'
> [WARNING] make[1]: Leaving directory `/home/root1/Projects/Branch2/hadoop-yarn-project/hadoop-yarn/hadoop-yarn-server/hadoop-yarn-server-nodemanager/target/native'
> [WARNING] /home/root1/Projects/Branch2/hadoop-yarn-project/hadoop-yarn/hadoop-yarn-server/hadoop-yarn-server-nodemanager/src/main/native/container-executor/impl/utils/string-utils.c:
In function ‘all_numbers’:
> [WARNING] /home/root1/Projects/Branch2/hadoop-yarn-project/hadoop-yarn/hadoop-yarn-server/hadoop-yarn-server-nodemanager/src/main/native/container-executor/impl/utils/string-utils.c:33:3:
error: ‘for’ loop initial declarations are only allowed in C99 mode
> [WARNING]    for (int i = 0; i < strlen(input); i++) {
> [WARNING]    ^
> [WARNING] /home/root1/Projects/Branch2/hadoop-yarn-project/hadoop-yarn/hadoop-yarn-server/hadoop-yarn-server-nodemanager/src/main/native/container-executor/impl/utils/string-utils.c:33:3:
note: use option -std=c99 or -std=gnu99 to compile your code
> [WARNING] make[2]: *** [CMakeFiles/container.dir/main/native/container-executor/impl/utils/string-utils.c.o]
Error 1
> [WARNING] make[2]: *** Waiting for unfinished jobs....
> [WARNING] /home/root1/Projects/Branch2/hadoop-yarn-project/hadoop-yarn/hadoop-yarn-server/hadoop-yarn-server-nodemanager/src/main/native/container-executor/impl/container-executor.c:
In function ‘tokenize_docker_command’:
> [WARNING] /home/root1/Projects/Branch2/hadoop-yarn-project/hadoop-yarn/hadoop-yarn-server/hadoop-yarn-server-nodemanager/src/main/native/container-executor/impl/container-executor.c:1193:7:
warning: unused variable ‘c’ [-Wunused-variable]
> [WARNING]    int c = 0;
> [WARNING]        ^
> [WARNING] make[1]: *** [CMakeFiles/container.dir/all] Error 2
> [WARNING] make: *** [all] Error 2
> {noformat}



--
This message was sent by Atlassian JIRA
(v6.4.14#64029)

---------------------------------------------------------------------
To unsubscribe, e-mail: yarn-issues-unsubscribe@hadoop.apache.org
For additional commands, e-mail: yarn-issues-help@hadoop.apache.org


Mime
View raw message