hadoop-yarn-issues mailing list archives

Site index · List index
Message view « Date » · « Thread »
Top « Date » · « Thread »
From "Hadoop QA (JIRA)" <j...@apache.org>
Subject [jira] [Commented] (YARN-6141) ppc64le on Linux doesn't trigger __linux get_executable codepath
Date Thu, 16 Mar 2017 12:49:41 GMT

    [ https://issues.apache.org/jira/browse/YARN-6141?page=com.atlassian.jira.plugin.system.issuetabpanels:comment-tabpanel&focusedCommentId=15927948#comment-15927948
] 

Hadoop QA commented on YARN-6141:
---------------------------------

| (x) *{color:red}-1 overall{color}* |
\\
\\
|| Vote || Subsystem || Runtime || Comment ||
| {color:blue}0{color} | {color:blue} reexec {color} | {color:blue}  0m 26s{color} | {color:blue}
Docker mode activated. {color} |
| {color:green}+1{color} | {color:green} @author {color} | {color:green}  0m  0s{color} |
{color:green} The patch does not contain any @author tags. {color} |
| {color:red}-1{color} | {color:red} test4tests {color} | {color:red}  0m  0s{color} | {color:red}
The patch doesn't appear to include any new or modified tests. Please justify why no new tests
are needed for this patch. Also please list what manual steps were performed to verify this
patch. {color} |
| {color:green}+1{color} | {color:green} mvninstall {color} | {color:green} 13m 30s{color}
| {color:green} trunk passed {color} |
| {color:green}+1{color} | {color:green} compile {color} | {color:green}  0m 30s{color} |
{color:green} trunk passed {color} |
| {color:green}+1{color} | {color:green} mvnsite {color} | {color:green}  0m 29s{color} |
{color:green} trunk passed {color} |
| {color:green}+1{color} | {color:green} mvneclipse {color} | {color:green}  0m 15s{color}
| {color:green} trunk passed {color} |
| {color:green}+1{color} | {color:green} mvninstall {color} | {color:green}  0m 25s{color}
| {color:green} the patch passed {color} |
| {color:green}+1{color} | {color:green} compile {color} | {color:green}  0m 27s{color} |
{color:green} the patch passed {color} |
| {color:green}+1{color} | {color:green} cc {color} | {color:green}  0m 27s{color} | {color:green}
the patch passed {color} |
| {color:green}+1{color} | {color:green} javac {color} | {color:green}  0m 27s{color} | {color:green}
the patch passed {color} |
| {color:green}+1{color} | {color:green} mvnsite {color} | {color:green}  0m 26s{color} |
{color:green} the patch passed {color} |
| {color:green}+1{color} | {color:green} mvneclipse {color} | {color:green}  0m 12s{color}
| {color:green} the patch passed {color} |
| {color:green}+1{color} | {color:green} whitespace {color} | {color:green}  0m  0s{color}
| {color:green} The patch has no whitespace issues. {color} |
| {color:green}+1{color} | {color:green} unit {color} | {color:green} 13m 20s{color} | {color:green}
hadoop-yarn-server-nodemanager in the patch passed. {color} |
| {color:green}+1{color} | {color:green} asflicense {color} | {color:green}  0m 17s{color}
| {color:green} The patch does not generate ASF License warnings. {color} |
| {color:black}{color} | {color:black} {color} | {color:black} 30m 41s{color} | {color:black}
{color} |
\\
\\
|| Subsystem || Report/Notes ||
| Docker |  Image:yetus/hadoop:a9ad5d6 |
| JIRA Issue | YARN-6141 |
| JIRA Patch URL | https://issues.apache.org/jira/secure/attachment/12859082/YARN-6141.patch
|
| Optional Tests |  asflicense  compile  cc  mvnsite  javac  unit  |
| uname | Linux 8dbe6d22e5f2 3.13.0-105-generic #152-Ubuntu SMP Fri Dec 2 15:37:11 UTC 2016
x86_64 x86_64 x86_64 GNU/Linux |
| Build tool | maven |
| Personality | /testptch/hadoop/patchprocess/precommit/personality/provided.sh |
| git revision | trunk / 6d95866 |
| Default Java | 1.8.0_121 |
|  Test Results | https://builds.apache.org/job/PreCommit-YARN-Build/15298/testReport/ |
| modules | C: hadoop-yarn-project/hadoop-yarn/hadoop-yarn-server/hadoop-yarn-server-nodemanager
U: hadoop-yarn-project/hadoop-yarn/hadoop-yarn-server/hadoop-yarn-server-nodemanager |
| Console output | https://builds.apache.org/job/PreCommit-YARN-Build/15298/console |
| Powered by | Apache Yetus 0.5.0-SNAPSHOT   http://yetus.apache.org |


This message was automatically generated.



> ppc64le on Linux doesn't trigger __linux get_executable codepath
> ----------------------------------------------------------------
>
>                 Key: YARN-6141
>                 URL: https://issues.apache.org/jira/browse/YARN-6141
>             Project: Hadoop YARN
>          Issue Type: Bug
>          Components: nodemanager
>    Affects Versions: 3.0.0-alpha3
>         Environment: $ uname -a
> Linux f8eef0f055cf 3.16.0-30-generic #40~14.04.1-Ubuntu SMP Thu Jan 15 17:42:36 UTC 2015
ppc64le ppc64le ppc64le GNU/Linux
>            Reporter: Sonia Garudi
>              Labels: ppc64le
>         Attachments: YARN-6141.patch
>
>
> On ppc64le architecture, the build fails in the 'Hadoop YARN NodeManager' project with
the below error:
> Cannot safely determine executable path with a relative HADOOP_CONF_DIR on this operating
system.
> [WARNING]  #error Cannot safely determine executable path with a relative HADOOP_CONF_DIR
on this operating system.
> [WARNING]   ^
> [WARNING] make[2]: *** [CMakeFiles/container.dir/main/native/container-executor/impl/get_executable.c.o]
Error 1
> [WARNING] make[2]: *** Waiting for unfinished jobs....
> [WARNING] make[1]: *** [CMakeFiles/container.dir/all] Error 2
> [WARNING] make: *** [all] Error 2
> [INFO] ------------------------------------------------------------------------
> [INFO] BUILD FAILURE
> [INFO] ------------------------------------------------------------------------
> Cmake version used :
> $ /usr/bin/cmake --version
> cmake version 2.8.12.2



--
This message was sent by Atlassian JIRA
(v6.3.15#6346)

---------------------------------------------------------------------
To unsubscribe, e-mail: yarn-issues-unsubscribe@hadoop.apache.org
For additional commands, e-mail: yarn-issues-help@hadoop.apache.org


Mime
View raw message