hadoop-yarn-issues mailing list archives

Site index · List index
Message view « Date » · « Thread »
Top « Date » · « Thread »
From "Hudson (JIRA)" <j...@apache.org>
Subject [jira] [Commented] (YARN-5934) Fix TestTimelineWebServices.testPrimaryFilterNumericString
Date Tue, 21 Mar 2017 23:21:41 GMT

    [ https://issues.apache.org/jira/browse/YARN-5934?page=com.atlassian.jira.plugin.system.issuetabpanels:comment-tabpanel&focusedCommentId=15935531#comment-15935531
] 

Hudson commented on YARN-5934:
------------------------------

ABORTED: Integrated in Jenkins build Hadoop-trunk-Commit #11440 (See [https://builds.apache.org/job/Hadoop-trunk-Commit/11440/])
YARN-5934. Fix TestTimelineWebServices.testPrimaryFilterNumericString (varunsaxena: rev f462e1ff68d698a669406d967336bb812cf6981b)
* (edit) hadoop-yarn-project/hadoop-yarn/hadoop-yarn-server/hadoop-yarn-server-applicationhistoryservice/src/test/java/org/apache/hadoop/yarn/server/timeline/webapp/TestTimelineWebServices.java


> Fix TestTimelineWebServices.testPrimaryFilterNumericString
> ----------------------------------------------------------
>
>                 Key: YARN-5934
>                 URL: https://issues.apache.org/jira/browse/YARN-5934
>             Project: Hadoop YARN
>          Issue Type: Bug
>          Components: test
>            Reporter: Akira Ajisaka
>            Assignee: Akira Ajisaka
>             Fix For: 3.0.0-alpha3
>
>         Attachments: YARN-5934.01.patch
>
>
> {noformat}
> Running org.apache.hadoop.yarn.server.timeline.webapp.TestTimelineWebServices
> Tests run: 28, Failures: 1, Errors: 0, Skipped: 0, Time elapsed: 43.297 sec <<<
FAILURE! - in org.apache.hadoop.yarn.server.timeline.webapp.TestTimelineWebServices
> testPrimaryFilterNumericString(org.apache.hadoop.yarn.server.timeline.webapp.TestTimelineWebServices)
 Time elapsed: 1.209 sec  <<< FAILURE!
> java.lang.AssertionError: expected:<0> but was:<3>
> 	at org.junit.Assert.fail(Assert.java:88)
> 	at org.junit.Assert.failNotEquals(Assert.java:743)
> 	at org.junit.Assert.assertEquals(Assert.java:118)
> 	at org.junit.Assert.assertEquals(Assert.java:555)
> 	at org.junit.Assert.assertEquals(Assert.java:542)
> 	at org.apache.hadoop.yarn.server.timeline.webapp.TestTimelineWebServices.testPrimaryFilterNumericString(TestTimelineWebServices.java:348)
> {noformat}



--
This message was sent by Atlassian JIRA
(v6.3.15#6346)

---------------------------------------------------------------------
To unsubscribe, e-mail: yarn-issues-unsubscribe@hadoop.apache.org
For additional commands, e-mail: yarn-issues-help@hadoop.apache.org


Mime
View raw message