hadoop-yarn-issues mailing list archives

Site index · List index
Message view « Date » · « Thread »
Top « Date » · « Thread »
From "Jason Lowe (JIRA)" <j...@apache.org>
Subject [jira] [Commented] (YARN-5655) TestContainerManagerSecurity is failing
Date Thu, 15 Sep 2016 20:06:20 GMT

    [ https://issues.apache.org/jira/browse/YARN-5655?page=com.atlassian.jira.plugin.system.issuetabpanels:comment-tabpanel&focusedCommentId=15494375#comment-15494375
] 

Jason Lowe commented on YARN-5655:
----------------------------------

git bisect points to this commit when it started failing in branch-2.8:
{noformat}
commit f9016dfec33f1d6486c03a54f0a479ed08aff34f
Author: Karthik Kambatla <kasha@cloudera.com>
Date:   Tue Sep 6 16:23:06 2016 -0700

    YARN-5566. Client-side NM graceful decom is not triggered when jobs finish. (Robert Kanter
via kasha)
{noformat}
  [~rkanter] [~kasha] could you take a look?

> TestContainerManagerSecurity is failing
> ---------------------------------------
>
>                 Key: YARN-5655
>                 URL: https://issues.apache.org/jira/browse/YARN-5655
>             Project: Hadoop YARN
>          Issue Type: Bug
>    Affects Versions: 2.8.0
>            Reporter: Jason Lowe
>
> TestContainerManagerSecurity has been failing recently in 2.8:
> {noformat}
> Running org.apache.hadoop.yarn.server.TestContainerManagerSecurity
> Tests run: 2, Failures: 1, Errors: 1, Skipped: 0, Time elapsed: 80.928 sec <<<
FAILURE! - in org.apache.hadoop.yarn.server.TestContainerManagerSecurity
> testContainerManager[0](org.apache.hadoop.yarn.server.TestContainerManagerSecurity) 
Time elapsed: 44.478 sec  <<< ERROR!
> java.lang.NullPointerException: null
> 	at org.apache.hadoop.yarn.server.TestContainerManagerSecurity.waitForContainerToFinishOnNM(TestContainerManagerSecurity.java:394)
> 	at org.apache.hadoop.yarn.server.TestContainerManagerSecurity.testNMTokens(TestContainerManagerSecurity.java:337)
> 	at org.apache.hadoop.yarn.server.TestContainerManagerSecurity.testContainerManager(TestContainerManagerSecurity.java:157)
> testContainerManager[1](org.apache.hadoop.yarn.server.TestContainerManagerSecurity) 
Time elapsed: 34.964 sec  <<< FAILURE!
> java.lang.AssertionError: null
> 	at org.junit.Assert.fail(Assert.java:86)
> 	at org.junit.Assert.assertTrue(Assert.java:41)
> 	at org.junit.Assert.assertTrue(Assert.java:52)
> 	at org.apache.hadoop.yarn.server.TestContainerManagerSecurity.testNMTokens(TestContainerManagerSecurity.java:333)
> 	at org.apache.hadoop.yarn.server.TestContainerManagerSecurity.testContainerManager(TestContainerManagerSecurity.java:157)
> {noformat}



--
This message was sent by Atlassian JIRA
(v6.3.4#6332)

---------------------------------------------------------------------
To unsubscribe, e-mail: yarn-issues-unsubscribe@hadoop.apache.org
For additional commands, e-mail: yarn-issues-help@hadoop.apache.org


Mime
View raw message