hadoop-yarn-issues mailing list archives

Site index · List index
Message view « Date » · « Thread »
Top « Date » · « Thread »
From "Hadoop QA (JIRA)" <j...@apache.org>
Subject [jira] [Commented] (YARN-5537) Intermittent test failure of TestAMRMClient#testAMRMClientWithContainerResourceChange
Date Wed, 24 Aug 2016 16:17:21 GMT

    [ https://issues.apache.org/jira/browse/YARN-5537?page=com.atlassian.jira.plugin.system.issuetabpanels:comment-tabpanel&focusedCommentId=15435195#comment-15435195
] 

Hadoop QA commented on YARN-5537:
---------------------------------

| (x) *{color:red}-1 overall{color}* |
\\
\\
|| Vote || Subsystem || Runtime || Comment ||
| {color:blue}0{color} | {color:blue} reexec {color} | {color:blue} 0m 17s {color} | {color:blue}
Docker mode activated. {color} |
| {color:green}+1{color} | {color:green} @author {color} | {color:green} 0m 0s {color} | {color:green}
The patch does not contain any @author tags. {color} |
| {color:green}+1{color} | {color:green} test4tests {color} | {color:green} 0m 0s {color}
| {color:green} The patch appears to include 1 new or modified test files. {color} |
| {color:green}+1{color} | {color:green} mvninstall {color} | {color:green} 6m 48s {color}
| {color:green} trunk passed {color} |
| {color:green}+1{color} | {color:green} compile {color} | {color:green} 0m 20s {color} |
{color:green} trunk passed {color} |
| {color:green}+1{color} | {color:green} checkstyle {color} | {color:green} 0m 14s {color}
| {color:green} trunk passed {color} |
| {color:green}+1{color} | {color:green} mvnsite {color} | {color:green} 0m 25s {color} |
{color:green} trunk passed {color} |
| {color:green}+1{color} | {color:green} mvneclipse {color} | {color:green} 0m 14s {color}
| {color:green} trunk passed {color} |
| {color:green}+1{color} | {color:green} findbugs {color} | {color:green} 0m 29s {color} |
{color:green} trunk passed {color} |
| {color:green}+1{color} | {color:green} javadoc {color} | {color:green} 0m 15s {color} |
{color:green} trunk passed {color} |
| {color:green}+1{color} | {color:green} mvninstall {color} | {color:green} 0m 18s {color}
| {color:green} the patch passed {color} |
| {color:green}+1{color} | {color:green} compile {color} | {color:green} 0m 17s {color} |
{color:green} the patch passed {color} |
| {color:green}+1{color} | {color:green} javac {color} | {color:green} 0m 17s {color} | {color:green}
the patch passed {color} |
| {color:red}-1{color} | {color:red} checkstyle {color} | {color:red} 0m 12s {color} | {color:red}
hadoop-yarn-project/hadoop-yarn/hadoop-yarn-client: The patch generated 1 new + 56 unchanged
- 0 fixed = 57 total (was 56) {color} |
| {color:green}+1{color} | {color:green} mvnsite {color} | {color:green} 0m 21s {color} |
{color:green} the patch passed {color} |
| {color:green}+1{color} | {color:green} mvneclipse {color} | {color:green} 0m 12s {color}
| {color:green} the patch passed {color} |
| {color:green}+1{color} | {color:green} whitespace {color} | {color:green} 0m 0s {color}
| {color:green} The patch has no whitespace issues. {color} |
| {color:green}+1{color} | {color:green} findbugs {color} | {color:green} 0m 33s {color} |
{color:green} the patch passed {color} |
| {color:green}+1{color} | {color:green} javadoc {color} | {color:green} 0m 12s {color} |
{color:green} the patch passed {color} |
| {color:red}-1{color} | {color:red} unit {color} | {color:red} 15m 56s {color} | {color:red}
hadoop-yarn-client in the patch failed. {color} |
| {color:green}+1{color} | {color:green} asflicense {color} | {color:green} 0m 15s {color}
| {color:green} The patch does not generate ASF License warnings. {color} |
| {color:black}{color} | {color:black} {color} | {color:black} 27m 53s {color} | {color:black}
{color} |
\\
\\
|| Reason || Tests ||
| Failed junit tests | hadoop.yarn.client.api.impl.TestYarnClient |
\\
\\
|| Subsystem || Report/Notes ||
| Docker |  Image:yetus/hadoop:9560f25 |
| JIRA Patch URL | https://issues.apache.org/jira/secure/attachment/12825278/YARN-5537.0003.patch
|
| JIRA Issue | YARN-5537 |
| Optional Tests |  asflicense  compile  javac  javadoc  mvninstall  mvnsite  unit  findbugs
 checkstyle  |
| uname | Linux 0eb7354d3cad 3.13.0-36-lowlatency #63-Ubuntu SMP PREEMPT Wed Sep 3 21:56:12
UTC 2014 x86_64 x86_64 x86_64 GNU/Linux |
| Build tool | maven |
| Personality | /testptch/hadoop/patchprocess/precommit/personality/provided.sh |
| git revision | trunk / 6fa9bf4 |
| Default Java | 1.8.0_101 |
| findbugs | v3.0.0 |
| checkstyle | https://builds.apache.org/job/PreCommit-YARN-Build/12876/artifact/patchprocess/diff-checkstyle-hadoop-yarn-project_hadoop-yarn_hadoop-yarn-client.txt
|
| unit | https://builds.apache.org/job/PreCommit-YARN-Build/12876/artifact/patchprocess/patch-unit-hadoop-yarn-project_hadoop-yarn_hadoop-yarn-client.txt
|
| unit test logs |  https://builds.apache.org/job/PreCommit-YARN-Build/12876/artifact/patchprocess/patch-unit-hadoop-yarn-project_hadoop-yarn_hadoop-yarn-client.txt
|
|  Test Results | https://builds.apache.org/job/PreCommit-YARN-Build/12876/testReport/ |
| modules | C: hadoop-yarn-project/hadoop-yarn/hadoop-yarn-client U: hadoop-yarn-project/hadoop-yarn/hadoop-yarn-client
|
| Console output | https://builds.apache.org/job/PreCommit-YARN-Build/12876/console |
| Powered by | Apache Yetus 0.3.0   http://yetus.apache.org |


This message was automatically generated.



> Intermittent test failure of TestAMRMClient#testAMRMClientWithContainerResourceChange
> -------------------------------------------------------------------------------------
>
>                 Key: YARN-5537
>                 URL: https://issues.apache.org/jira/browse/YARN-5537
>             Project: Hadoop YARN
>          Issue Type: Bug
>            Reporter: Varun Saxena
>            Assignee: Bibin A Chundatt
>         Attachments: Failure.txt, Failure_allocate.txt, YARN-5537.0001.patch, YARN-5537.0002.patch,
YARN-5537.0003.patch
>
>
> Refer to test report https://builds.apache.org/job/PreCommit-YARN-Build/12692/testReport/
> {noformat}
> Running org.apache.hadoop.yarn.client.api.impl.TestAMRMClient
> Tests run: 1, Failures: 1, Errors: 0, Skipped: 0, Time elapsed: 12.018 sec <<<
FAILURE! - in org.apache.hadoop.yarn.client.api.impl.TestAMRMClient
> testAMRMClientWithContainerResourceChange(org.apache.hadoop.yarn.client.api.impl.TestAMRMClient)
 Time elapsed: 1.183 sec  <<< FAILURE!
> java.lang.AssertionError: expected:<0> but was:<1>
> 	at org.junit.Assert.fail(Assert.java:88)
> 	at org.junit.Assert.failNotEquals(Assert.java:743)
> 	at org.junit.Assert.assertEquals(Assert.java:118)
> 	at org.junit.Assert.assertEquals(Assert.java:555)
> 	at org.junit.Assert.assertEquals(Assert.java:542)
> 	at org.apache.hadoop.yarn.client.api.impl.TestAMRMClient.doContainerResourceChange(TestAMRMClient.java:1019)
> 	at org.apache.hadoop.yarn.client.api.impl.TestAMRMClient.testAMRMClientWithContainerResourceChange(TestAMRMClient.java:909)
> {noformat}



--
This message was sent by Atlassian JIRA
(v6.3.4#6332)

---------------------------------------------------------------------
To unsubscribe, e-mail: yarn-issues-unsubscribe@hadoop.apache.org
For additional commands, e-mail: yarn-issues-help@hadoop.apache.org


Mime
View raw message