hadoop-yarn-issues mailing list archives

Site index · List index
Message view « Date » · « Thread »
Top « Date » · « Thread »
From "Hadoop QA (JIRA)" <j...@apache.org>
Subject [jira] [Commented] (YARN-5416) TestRMRestart#testRMRestartWaitForPreviousAMToFinish failed intermittently due to not wait SchedulerApplicationAttempt to be stopped
Date Thu, 21 Jul 2016 19:36:22 GMT

    [ https://issues.apache.org/jira/browse/YARN-5416?page=com.atlassian.jira.plugin.system.issuetabpanels:comment-tabpanel&focusedCommentId=15388279#comment-15388279
] 

Hadoop QA commented on YARN-5416:
---------------------------------

| (x) *{color:red}-1 overall{color}* |
\\
\\
|| Vote || Subsystem || Runtime || Comment ||
| {color:blue}0{color} | {color:blue} reexec {color} | {color:blue} 0m 18s {color} | {color:blue}
Docker mode activated. {color} |
| {color:green}+1{color} | {color:green} @author {color} | {color:green} 0m 0s {color} | {color:green}
The patch does not contain any @author tags. {color} |
| {color:green}+1{color} | {color:green} test4tests {color} | {color:green} 0m 0s {color}
| {color:green} The patch appears to include 2 new or modified test files. {color} |
| {color:green}+1{color} | {color:green} mvninstall {color} | {color:green} 7m 24s {color}
| {color:green} trunk passed {color} |
| {color:green}+1{color} | {color:green} compile {color} | {color:green} 0m 35s {color} |
{color:green} trunk passed {color} |
| {color:green}+1{color} | {color:green} checkstyle {color} | {color:green} 0m 22s {color}
| {color:green} trunk passed {color} |
| {color:green}+1{color} | {color:green} mvnsite {color} | {color:green} 0m 40s {color} |
{color:green} trunk passed {color} |
| {color:green}+1{color} | {color:green} mvneclipse {color} | {color:green} 0m 18s {color}
| {color:green} trunk passed {color} |
| {color:green}+1{color} | {color:green} findbugs {color} | {color:green} 1m 2s {color} |
{color:green} trunk passed {color} |
| {color:green}+1{color} | {color:green} javadoc {color} | {color:green} 0m 22s {color} |
{color:green} trunk passed {color} |
| {color:green}+1{color} | {color:green} mvninstall {color} | {color:green} 0m 32s {color}
| {color:green} the patch passed {color} |
| {color:green}+1{color} | {color:green} compile {color} | {color:green} 0m 31s {color} |
{color:green} the patch passed {color} |
| {color:green}+1{color} | {color:green} javac {color} | {color:green} 0m 31s {color} | {color:green}
the patch passed {color} |
| {color:red}-1{color} | {color:red} checkstyle {color} | {color:red} 0m 19s {color} | {color:red}
hadoop-yarn-project/hadoop-yarn/hadoop-yarn-server/hadoop-yarn-server-resourcemanager: The
patch generated 3 new + 100 unchanged - 2 fixed = 103 total (was 102) {color} |
| {color:green}+1{color} | {color:green} mvnsite {color} | {color:green} 0m 36s {color} |
{color:green} the patch passed {color} |
| {color:green}+1{color} | {color:green} mvneclipse {color} | {color:green} 0m 15s {color}
| {color:green} the patch passed {color} |
| {color:green}+1{color} | {color:green} whitespace {color} | {color:green} 0m 0s {color}
| {color:green} The patch has no whitespace issues. {color} |
| {color:green}+1{color} | {color:green} findbugs {color} | {color:green} 1m 9s {color} |
{color:green} the patch passed {color} |
| {color:green}+1{color} | {color:green} javadoc {color} | {color:green} 0m 19s {color} |
{color:green} the patch passed {color} |
| {color:green}+1{color} | {color:green} unit {color} | {color:green} 34m 1s {color} | {color:green}
hadoop-yarn-server-resourcemanager in the patch passed. {color} |
| {color:green}+1{color} | {color:green} asflicense {color} | {color:green} 0m 15s {color}
| {color:green} The patch does not generate ASF License warnings. {color} |
| {color:black}{color} | {color:black} {color} | {color:black} 49m 37s {color} | {color:black}
{color} |
\\
\\
|| Subsystem || Report/Notes ||
| Docker |  Image:yetus/hadoop:9560f25 |
| JIRA Patch URL | https://issues.apache.org/jira/secure/attachment/12819424/YARN-5416.patch
|
| JIRA Issue | YARN-5416 |
| Optional Tests |  asflicense  compile  javac  javadoc  mvninstall  mvnsite  unit  findbugs
 checkstyle  |
| uname | Linux 6ea94621e588 3.13.0-36-lowlatency #63-Ubuntu SMP PREEMPT Wed Sep 3 21:56:12
UTC 2014 x86_64 x86_64 x86_64 GNU/Linux |
| Build tool | maven |
| Personality | /testptch/hadoop/patchprocess/precommit/personality/provided.sh |
| git revision | trunk / ecff7d0 |
| Default Java | 1.8.0_91 |
| findbugs | v3.0.0 |
| checkstyle | https://builds.apache.org/job/PreCommit-YARN-Build/12444/artifact/patchprocess/diff-checkstyle-hadoop-yarn-project_hadoop-yarn_hadoop-yarn-server_hadoop-yarn-server-resourcemanager.txt
|
|  Test Results | https://builds.apache.org/job/PreCommit-YARN-Build/12444/testReport/ |
| modules | C: hadoop-yarn-project/hadoop-yarn/hadoop-yarn-server/hadoop-yarn-server-resourcemanager
U: hadoop-yarn-project/hadoop-yarn/hadoop-yarn-server/hadoop-yarn-server-resourcemanager |
| Console output | https://builds.apache.org/job/PreCommit-YARN-Build/12444/console |
| Powered by | Apache Yetus 0.3.0   http://yetus.apache.org |


This message was automatically generated.



> TestRMRestart#testRMRestartWaitForPreviousAMToFinish failed intermittently due to not
wait SchedulerApplicationAttempt to be stopped
> ------------------------------------------------------------------------------------------------------------------------------------
>
>                 Key: YARN-5416
>                 URL: https://issues.apache.org/jira/browse/YARN-5416
>             Project: Hadoop YARN
>          Issue Type: Sub-task
>          Components: test, yarn
>            Reporter: Junping Du
>            Assignee: Junping Du
>            Priority: Minor
>         Attachments: YARN-5416.patch
>
>
> The test failure stack is:
> Running org.apache.hadoop.yarn.server.resourcemanager.TestRMRestart
> Tests run: 54, Failures: 1, Errors: 0, Skipped: 0, Time elapsed: 385.338 sec <<<
FAILURE! - in org.apache.hadoop.yarn.server.resourcemanager.TestRMRestart
> testRMRestartWaitForPreviousAMToFinish[0](org.apache.hadoop.yarn.server.resourcemanager.TestRMRestart)
 Time elapsed: 43.134 sec  <<< FAILURE!
> java.lang.AssertionError: AppAttempt state is not correct (timedout) expected:<ALLOCATED>
but was:<SCHEDULED>
> 	at org.junit.Assert.fail(Assert.java:88)
> 	at org.junit.Assert.failNotEquals(Assert.java:743)
> 	at org.junit.Assert.assertEquals(Assert.java:118)
> 	at org.apache.hadoop.yarn.server.resourcemanager.MockAM.waitForState(MockAM.java:86)
> 	at org.apache.hadoop.yarn.server.resourcemanager.MockRM.sendAMLaunched(MockRM.java:594)
> 	at org.apache.hadoop.yarn.server.resourcemanager.TestRMRestart.launchAM(TestRMRestart.java:1008)
> 	at org.apache.hadoop.yarn.server.resourcemanager.TestRMRestart.testRMRestartWaitForPreviousAMToFinish(TestRMRestart.java:530)
> This is due to the same issue that partially fixed in YARN-4968



--
This message was sent by Atlassian JIRA
(v6.3.4#6332)

---------------------------------------------------------------------
To unsubscribe, e-mail: yarn-issues-unsubscribe@hadoop.apache.org
For additional commands, e-mail: yarn-issues-help@hadoop.apache.org


Mime
View raw message