hadoop-yarn-issues mailing list archives

Site index · List index
Message view « Date » · « Thread »
Top « Date » · « Thread »
From "Rohith Sharma K S (JIRA)" <j...@apache.org>
Subject [jira] [Commented] (YARN-5213) TestLogsCLI#testFetchApplictionLogs fails intermittently
Date Sat, 16 Jul 2016 07:15:20 GMT

    [ https://issues.apache.org/jira/browse/YARN-5213?page=com.atlassian.jira.plugin.system.issuetabpanels:comment-tabpanel&focusedCommentId=15380584#comment-15380584
] 

Rohith Sharma K S commented on YARN-5213:
-----------------------------------------

Recent build failure for this test case [Link|https://builds.apache.org/job/PreCommit-YARN-Build/12341/artifact/patchprocess/patch-unit-hadoop-yarn-project_hadoop-yarn_hadoop-yarn-client.txt]
{noformat}
Tests run: 13, Failures: 1, Errors: 0, Skipped: 0, Time elapsed: 2.353 sec <<< FAILURE!
- in org.apache.hadoop.yarn.client.cli.TestLogsCLI
testFetchFinishedApplictionLogs(org.apache.hadoop.yarn.client.cli.TestLogsCLI)  Time elapsed:
0.214 sec  <<< FAILURE!
org.junit.ComparisonFailure: expected:<[Hello]> but was:<[=====]>
	at org.junit.Assert.assertEquals(Assert.java:115)
	at org.junit.Assert.assertEquals(Assert.java:144)
	at org.apache.hadoop.yarn.client.cli.TestLogsCLI.testFetchFinishedApplictionLogs(TestLogsCLI.java:427)
{noformat}

> TestLogsCLI#testFetchApplictionLogs fails intermittently
> --------------------------------------------------------
>
>                 Key: YARN-5213
>                 URL: https://issues.apache.org/jira/browse/YARN-5213
>             Project: Hadoop YARN
>          Issue Type: Test
>          Components: test
>            Reporter: Rohith Sharma K S
>
> TestLogsCLI fails intermittently on build [link|https://builds.apache.org/job/PreCommit-YARN-Build/11910/artifact/patchprocess/patch-unit-hadoop-yarn-project_hadoop-yarn_hadoop-yarn-client.txt]
> {noformat}
> Running org.apache.hadoop.yarn.client.cli.TestLogsCLI
> Tests run: 11, Failures: 1, Errors: 0, Skipped: 0, Time elapsed: 1.708 sec <<<
FAILURE! - in org.apache.hadoop.yarn.client.cli.TestLogsCLI
> testFetchApplictionLogs(org.apache.hadoop.yarn.client.cli.TestLogsCLI)  Time elapsed:
0.176 sec  <<< FAILURE!
> org.junit.ComparisonFailure: expected:<[Hello]> but was:<[=====]>
> 	at org.junit.Assert.assertEquals(Assert.java:115)
> 	at org.junit.Assert.assertEquals(Assert.java:144)
> 	at org.apache.hadoop.yarn.client.cli.TestLogsCLI.testFetchApplictionLogs(TestLogsCLI.java:389)
> {noformat}



--
This message was sent by Atlassian JIRA
(v6.3.4#6332)

---------------------------------------------------------------------
To unsubscribe, e-mail: yarn-issues-unsubscribe@hadoop.apache.org
For additional commands, e-mail: yarn-issues-help@hadoop.apache.org


Mime
View raw message