hadoop-yarn-issues mailing list archives

Site index · List index
Message view « Date » · « Thread »
Top « Date » · « Thread »
From "Hadoop QA (JIRA)" <j...@apache.org>
Subject [jira] [Commented] (YARN-5037) TestRMRestart#testQueueMetricsOnRMRestart random faiure
Date Sat, 09 Jul 2016 08:33:11 GMT

    [ https://issues.apache.org/jira/browse/YARN-5037?page=com.atlassian.jira.plugin.system.issuetabpanels:comment-tabpanel&focusedCommentId=15369002#comment-15369002
] 

Hadoop QA commented on YARN-5037:
---------------------------------

| (x) *{color:red}-1 overall{color}* |
\\
\\
|| Vote || Subsystem || Runtime || Comment ||
| {color:blue}0{color} | {color:blue} reexec {color} | {color:blue} 0m 29s {color} | {color:blue}
Docker mode activated. {color} |
| {color:green}+1{color} | {color:green} @author {color} | {color:green} 0m 0s {color} | {color:green}
The patch does not contain any @author tags. {color} |
| {color:green}+1{color} | {color:green} test4tests {color} | {color:green} 0m 0s {color}
| {color:green} The patch appears to include 2 new or modified test files. {color} |
| {color:green}+1{color} | {color:green} mvninstall {color} | {color:green} 7m 34s {color}
| {color:green} trunk passed {color} |
| {color:green}+1{color} | {color:green} compile {color} | {color:green} 0m 34s {color} |
{color:green} trunk passed {color} |
| {color:green}+1{color} | {color:green} checkstyle {color} | {color:green} 0m 21s {color}
| {color:green} trunk passed {color} |
| {color:green}+1{color} | {color:green} mvnsite {color} | {color:green} 0m 39s {color} |
{color:green} trunk passed {color} |
| {color:green}+1{color} | {color:green} mvneclipse {color} | {color:green} 0m 15s {color}
| {color:green} trunk passed {color} |
| {color:green}+1{color} | {color:green} findbugs {color} | {color:green} 1m 4s {color} |
{color:green} trunk passed {color} |
| {color:green}+1{color} | {color:green} javadoc {color} | {color:green} 0m 21s {color} |
{color:green} trunk passed {color} |
| {color:green}+1{color} | {color:green} mvninstall {color} | {color:green} 0m 35s {color}
| {color:green} the patch passed {color} |
| {color:green}+1{color} | {color:green} compile {color} | {color:green} 0m 30s {color} |
{color:green} the patch passed {color} |
| {color:green}+1{color} | {color:green} javac {color} | {color:green} 0m 30s {color} | {color:green}
the patch passed {color} |
| {color:red}-1{color} | {color:red} checkstyle {color} | {color:red} 0m 21s {color} | {color:red}
hadoop-yarn-project/hadoop-yarn/hadoop-yarn-server/hadoop-yarn-server-resourcemanager: The
patch generated 4 new + 120 unchanged - 0 fixed = 124 total (was 120) {color} |
| {color:green}+1{color} | {color:green} mvnsite {color} | {color:green} 0m 37s {color} |
{color:green} the patch passed {color} |
| {color:green}+1{color} | {color:green} mvneclipse {color} | {color:green} 0m 12s {color}
| {color:green} the patch passed {color} |
| {color:green}+1{color} | {color:green} whitespace {color} | {color:green} 0m 0s {color}
| {color:green} The patch has no whitespace issues. {color} |
| {color:green}+1{color} | {color:green} findbugs {color} | {color:green} 1m 8s {color} |
{color:green} the patch passed {color} |
| {color:green}+1{color} | {color:green} javadoc {color} | {color:green} 0m 18s {color} |
{color:green} the patch passed {color} |
| {color:red}-1{color} | {color:red} unit {color} | {color:red} 36m 23s {color} | {color:red}
hadoop-yarn-server-resourcemanager in the patch failed. {color} |
| {color:green}+1{color} | {color:green} asflicense {color} | {color:green} 0m 18s {color}
| {color:green} The patch does not generate ASF License warnings. {color} |
| {color:black}{color} | {color:black} {color} | {color:black} 52m 24s {color} | {color:black}
{color} |
\\
\\
|| Reason || Tests ||
| Failed junit tests | hadoop.yarn.server.resourcemanager.TestWorkPreservingRMRestart |
|   | hadoop.yarn.server.resourcemanager.scheduler.fair.TestContinuousScheduling |
\\
\\
|| Subsystem || Report/Notes ||
| Docker |  Image:yetus/hadoop:9560f25 |
| JIRA Patch URL | https://issues.apache.org/jira/secure/attachment/12816977/YARN-5037.02.patch
|
| JIRA Issue | YARN-5037 |
| Optional Tests |  asflicense  compile  javac  javadoc  mvninstall  mvnsite  unit  findbugs
 checkstyle  |
| uname | Linux f6a0767aa36d 3.13.0-36-lowlatency #63-Ubuntu SMP PREEMPT Wed Sep 3 21:56:12
UTC 2014 x86_64 x86_64 x86_64 GNU/Linux |
| Build tool | maven |
| Personality | /testptch/hadoop/patchprocess/precommit/personality/provided.sh |
| git revision | trunk / da6f1b8 |
| Default Java | 1.8.0_91 |
| findbugs | v3.0.0 |
| checkstyle | https://builds.apache.org/job/PreCommit-YARN-Build/12250/artifact/patchprocess/diff-checkstyle-hadoop-yarn-project_hadoop-yarn_hadoop-yarn-server_hadoop-yarn-server-resourcemanager.txt
|
| unit | https://builds.apache.org/job/PreCommit-YARN-Build/12250/artifact/patchprocess/patch-unit-hadoop-yarn-project_hadoop-yarn_hadoop-yarn-server_hadoop-yarn-server-resourcemanager.txt
|
| unit test logs |  https://builds.apache.org/job/PreCommit-YARN-Build/12250/artifact/patchprocess/patch-unit-hadoop-yarn-project_hadoop-yarn_hadoop-yarn-server_hadoop-yarn-server-resourcemanager.txt
|
|  Test Results | https://builds.apache.org/job/PreCommit-YARN-Build/12250/testReport/ |
| modules | C: hadoop-yarn-project/hadoop-yarn/hadoop-yarn-server/hadoop-yarn-server-resourcemanager
U: hadoop-yarn-project/hadoop-yarn/hadoop-yarn-server/hadoop-yarn-server-resourcemanager |
| Console output | https://builds.apache.org/job/PreCommit-YARN-Build/12250/console |
| Powered by | Apache Yetus 0.3.0   http://yetus.apache.org |


This message was automatically generated.



> TestRMRestart#testQueueMetricsOnRMRestart random faiure
> -------------------------------------------------------
>
>                 Key: YARN-5037
>                 URL: https://issues.apache.org/jira/browse/YARN-5037
>             Project: Hadoop YARN
>          Issue Type: Test
>            Reporter: sandflee
>            Assignee: sandflee
>         Attachments: YARN-5037.01.patch, YARN-5037.02.patch
>
>
> https://builds.apache.org/job/PreCommit-YARN-Build/11326/artifact/patchprocess/patch-unit-hadoop-yarn-project_hadoop-yarn_hadoop-yarn-server_hadoop-yarn-server-resourcemanager-jdk1.7.0_95.txt
> {noformat}
> Tests run: 28, Failures: 1, Errors: 0, Skipped: 0, Time elapsed: 67.159 sec <<<
FAILURE! - in org.apache.hadoop.yarn.server.resourcemanager.TestRMRestart
> testQueueMetricsOnRMRestart(org.apache.hadoop.yarn.server.resourcemanager.TestRMRestart)
 Time elapsed: 2.561 sec  <<< FAILURE!
> java.lang.AssertionError: expected:<2> but was:<1>
> 	at org.junit.Assert.fail(Assert.java:88)
> 	at org.junit.Assert.failNotEquals(Assert.java:743)
> 	at org.junit.Assert.assertEquals(Assert.java:118)
> 	at org.junit.Assert.assertEquals(Assert.java:555)
> 	at org.junit.Assert.assertEquals(Assert.java:542)
> 	at org.apache.hadoop.yarn.server.resourcemanager.TestRMRestart.assertQueueMetrics(TestRMRestart.java:1874)
> 	at org.apache.hadoop.yarn.server.resourcemanager.TestRMRestart.testQueueMetricsOnRMRestart(TestRMRestart.java:1849)
> {noformat}



--
This message was sent by Atlassian JIRA
(v6.3.4#6332)

---------------------------------------------------------------------
To unsubscribe, e-mail: yarn-issues-unsubscribe@hadoop.apache.org
For additional commands, e-mail: yarn-issues-help@hadoop.apache.org


Mime
View raw message