hadoop-yarn-issues mailing list archives

Site index · List index
Message view « Date » · « Thread »
Top « Date » · « Thread »
From "Rohith Sharma K S (JIRA)" <j...@apache.org>
Subject [jira] [Created] (YARN-5240) TestSystemMetricsPublisher.testPublishApplicationMetrics fails in trunk
Date Sat, 11 Jun 2016 04:29:20 GMT
Rohith Sharma K S created YARN-5240:
---------------------------------------

             Summary: TestSystemMetricsPublisher.testPublishApplicationMetrics fails in trunk
                 Key: YARN-5240
                 URL: https://issues.apache.org/jira/browse/YARN-5240
             Project: Hadoop YARN
          Issue Type: Test
          Components: t, test
            Reporter: Rohith Sharma K S


In the build [link|https://builds.apache.org/job/PreCommit-YARN-Build/11975/artifact/patchprocess/patch-unit-hadoop-yarn-project_hadoop-yarn_hadoop-yarn-server_hadoop-yarn-server-resourcemanager.txt]
test case failed. 
{noformat}
Tests run: 5, Failures: 1, Errors: 0, Skipped: 0, Time elapsed: 6.554 sec <<< FAILURE!
- in org.apache.hadoop.yarn.server.resourcemanager.metrics.TestSystemMetricsPublisher
testPublishApplicationMetrics(org.apache.hadoop.yarn.server.resourcemanager.metrics.TestSystemMetricsPublisher)
 Time elapsed: 2.206 sec  <<< FAILURE!
java.lang.AssertionError: expected:<> but was:<null>
	at org.junit.Assert.fail(Assert.java:88)
	at org.junit.Assert.failNotEquals(Assert.java:743)
	at org.junit.Assert.assertEquals(Assert.java:118)
	at org.junit.Assert.assertEquals(Assert.java:144)
	at org.apache.hadoop.yarn.server.resourcemanager.metrics.TestSystemMetricsPublisher.testPublishApplicationMetrics(TestSystemMetricsPublisher.java:201)

{noformat}



--
This message was sent by Atlassian JIRA
(v6.3.4#6332)

---------------------------------------------------------------------
To unsubscribe, e-mail: yarn-issues-unsubscribe@hadoop.apache.org
For additional commands, e-mail: yarn-issues-help@hadoop.apache.org


Mime
View raw message