hadoop-yarn-issues mailing list archives

Site index · List index
Message view « Date » · « Thread »
Top « Date » · « Thread »
From "Hadoop QA (JIRA)" <j...@apache.org>
Subject [jira] [Commented] (YARN-5166) javadoc:javadoc goal fails on hadoop-yarn-client
Date Fri, 27 May 2016 00:08:12 GMT

    [ https://issues.apache.org/jira/browse/YARN-5166?page=com.atlassian.jira.plugin.system.issuetabpanels:comment-tabpanel&focusedCommentId=15303222#comment-15303222
] 

Hadoop QA commented on YARN-5166:
---------------------------------

| (x) *{color:red}-1 overall{color}* |
\\
\\
|| Vote || Subsystem || Runtime || Comment ||
| {color:blue}0{color} | {color:blue} reexec {color} | {color:blue} 0m 12s {color} | {color:blue}
Docker mode activated. {color} |
| {color:green}+1{color} | {color:green} @author {color} | {color:green} 0m 0s {color} | {color:green}
The patch does not contain any @author tags. {color} |
| {color:red}-1{color} | {color:red} test4tests {color} | {color:red} 0m 0s {color} | {color:red}
The patch doesn't appear to include any new or modified tests. Please justify why no new tests
are needed for this patch. Also please list what manual steps were performed to verify this
patch. {color} |
| {color:green}+1{color} | {color:green} mvninstall {color} | {color:green} 6m 23s {color}
| {color:green} trunk passed {color} |
| {color:green}+1{color} | {color:green} compile {color} | {color:green} 0m 16s {color} |
{color:green} trunk passed {color} |
| {color:green}+1{color} | {color:green} checkstyle {color} | {color:green} 0m 15s {color}
| {color:green} trunk passed {color} |
| {color:green}+1{color} | {color:green} mvnsite {color} | {color:green} 0m 20s {color} |
{color:green} trunk passed {color} |
| {color:green}+1{color} | {color:green} mvneclipse {color} | {color:green} 0m 11s {color}
| {color:green} trunk passed {color} |
| {color:green}+1{color} | {color:green} findbugs {color} | {color:green} 0m 27s {color} |
{color:green} trunk passed {color} |
| {color:red}-1{color} | {color:red} javadoc {color} | {color:red} 0m 14s {color} | {color:red}
hadoop-yarn-client in trunk failed. {color} |
| {color:green}+1{color} | {color:green} mvninstall {color} | {color:green} 0m 16s {color}
| {color:green} the patch passed {color} |
| {color:green}+1{color} | {color:green} compile {color} | {color:green} 0m 14s {color} |
{color:green} the patch passed {color} |
| {color:green}+1{color} | {color:green} javac {color} | {color:green} 0m 14s {color} | {color:green}
the patch passed {color} |
| {color:green}+1{color} | {color:green} checkstyle {color} | {color:green} 0m 11s {color}
| {color:green} the patch passed {color} |
| {color:green}+1{color} | {color:green} mvnsite {color} | {color:green} 0m 17s {color} |
{color:green} the patch passed {color} |
| {color:green}+1{color} | {color:green} mvneclipse {color} | {color:green} 0m 9s {color}
| {color:green} the patch passed {color} |
| {color:green}+1{color} | {color:green} whitespace {color} | {color:green} 0m 0s {color}
| {color:green} Patch has no whitespace issues. {color} |
| {color:green}+1{color} | {color:green} findbugs {color} | {color:green} 0m 31s {color} |
{color:green} the patch passed {color} |
| {color:red}-1{color} | {color:red} javadoc {color} | {color:red} 0m 57s {color} | {color:red}
hadoop-yarn-project_hadoop-yarn_hadoop-yarn-client generated 180 new + 0 unchanged - 181 fixed
= 180 total (was 181) {color} |
| {color:green}+1{color} | {color:green} javadoc {color} | {color:green} 0m 12s {color} |
{color:green} the patch passed {color} |
| {color:red}-1{color} | {color:red} unit {color} | {color:red} 68m 7s {color} | {color:red}
hadoop-yarn-client in the patch failed. {color} |
| {color:green}+1{color} | {color:green} asflicense {color} | {color:green} 0m 15s {color}
| {color:green} Patch does not generate ASF License warnings. {color} |
| {color:black}{color} | {color:black} {color} | {color:black} 79m 5s {color} | {color:black}
{color} |
\\
\\
|| Reason || Tests ||
| Failed junit tests | hadoop.yarn.client.TestGetGroups |
|   | hadoop.yarn.client.api.impl.TestDistributedScheduling |
|   | hadoop.yarn.client.api.impl.TestAMRMProxy |
| Timed out junit tests | org.apache.hadoop.yarn.client.cli.TestYarnCLI |
|   | org.apache.hadoop.yarn.client.api.impl.TestYarnClient |
|   | org.apache.hadoop.yarn.client.api.impl.TestAMRMClient |
|   | org.apache.hadoop.yarn.client.api.impl.TestNMClient |
\\
\\
|| Subsystem || Report/Notes ||
| Docker |  Image:yetus/hadoop:2c91fd8 |
| JIRA Patch URL | https://issues.apache.org/jira/secure/attachment/12806499/YARN-5166.01.patch
|
| JIRA Issue | YARN-5166 |
| Optional Tests |  asflicense  compile  javac  javadoc  mvninstall  mvnsite  unit  findbugs
 checkstyle  |
| uname | Linux 42a32ce26569 3.13.0-36-lowlatency #63-Ubuntu SMP PREEMPT Wed Sep 3 21:56:12
UTC 2014 x86_64 x86_64 x86_64 GNU/Linux |
| Build tool | maven |
| Personality | /testptch/hadoop/patchprocess/precommit/personality/provided.sh |
| git revision | trunk / 5b41b28 |
| Default Java | 1.8.0_91 |
| findbugs | v3.0.0 |
| javadoc | https://builds.apache.org/job/PreCommit-YARN-Build/11724/artifact/patchprocess/branch-javadoc-hadoop-yarn-project_hadoop-yarn_hadoop-yarn-client.txt
|
| javadoc | hadoop-yarn-project_hadoop-yarn_hadoop-yarn-client: https://builds.apache.org/job/PreCommit-YARN-Build/11724/artifact/patchprocess/diff-javadoc-javadoc-hadoop-yarn-project_hadoop-yarn_hadoop-yarn-client.txt
|
| unit | https://builds.apache.org/job/PreCommit-YARN-Build/11724/artifact/patchprocess/patch-unit-hadoop-yarn-project_hadoop-yarn_hadoop-yarn-client.txt
|
| unit test logs |  https://builds.apache.org/job/PreCommit-YARN-Build/11724/artifact/patchprocess/patch-unit-hadoop-yarn-project_hadoop-yarn_hadoop-yarn-client.txt
|
|  Test Results | https://builds.apache.org/job/PreCommit-YARN-Build/11724/testReport/ |
| modules | C: hadoop-yarn-project/hadoop-yarn/hadoop-yarn-client U: hadoop-yarn-project/hadoop-yarn/hadoop-yarn-client
|
| Console output | https://builds.apache.org/job/PreCommit-YARN-Build/11724/console |
| Powered by | Apache Yetus 0.2.0   http://yetus.apache.org |


This message was automatically generated.



> javadoc:javadoc goal fails on hadoop-yarn-client
> ------------------------------------------------
>
>                 Key: YARN-5166
>                 URL: https://issues.apache.org/jira/browse/YARN-5166
>             Project: Hadoop YARN
>          Issue Type: Bug
>            Reporter: Andras Bokor
>            Assignee: Andras Bokor
>         Attachments: YARN-5166.01.patch
>
>
> {code}mvn clean javadoc:javadoc -DskipTests{code}
> {code}
> 2 errors
> 180 warnings
> [INFO] ------------------------------------------------------------------------
> [INFO] BUILD FAILURE
> [INFO] ------------------------------------------------------------------------
> [INFO] Total time: 5.758 s
> [INFO] Finished at: 2016-05-27T00:21:42+02:00
> [INFO] Final Memory: 29M/391M
> [INFO] ------------------------------------------------------------------------
> [ERROR] Failed to execute goal org.apache.maven.plugins:maven-javadoc-plugin:2.8.1:javadoc
(default-cli) on project hadoop-yarn-client: An error has occurred in JavaDocs report generation:
> [ERROR] Exit code: 1 - /Users/abokor/work/hdp/hadoop/hadoop-yarn-project/hadoop-yarn/hadoop-yarn-client/src/main/java/org/apache/hadoop/yarn/client/api/AHSClient.java:48:
warning: no @return
> [ERROR] public static AHSClient createAHSClient() {
> {code}



--
This message was sent by Atlassian JIRA
(v6.3.4#6332)

---------------------------------------------------------------------
To unsubscribe, e-mail: yarn-issues-unsubscribe@hadoop.apache.org
For additional commands, e-mail: yarn-issues-help@hadoop.apache.org


Mime
View raw message