hadoop-yarn-issues mailing list archives

Site index · List index
Message view « Date » · « Thread »
Top « Date » · « Thread »
From "Akira AJISAKA (JIRA)" <j...@apache.org>
Subject [jira] [Moved] (YARN-4938) TestMRJobs fails
Date Sun, 10 Apr 2016 15:58:25 GMT

     [ https://issues.apache.org/jira/browse/YARN-4938?page=com.atlassian.jira.plugin.system.issuetabpanels:all-tabpanel
]

Akira AJISAKA moved MAPREDUCE-6658 to YARN-4938:
------------------------------------------------

    Component/s:     (was: test)
                 test
            Key: YARN-4938  (was: MAPREDUCE-6658)
        Project: Hadoop YARN  (was: Hadoop Map/Reduce)

> TestMRJobs fails
> ----------------
>
>                 Key: YARN-4938
>                 URL: https://issues.apache.org/jira/browse/YARN-4938
>             Project: Hadoop YARN
>          Issue Type: Bug
>          Components: test
>            Reporter: Akira AJISAKA
>            Assignee: Eric Badger
>         Attachments: MAPREDUCE-6658.001.patch
>
>
> TestMRJobs#testJobWithChangePriority fails.
> {noformat}
> Running org.apache.hadoop.mapreduce.v2.TestMRJobs
> Tests run: 12, Failures: 1, Errors: 0, Skipped: 0, Time elapsed: 446.855 sec <<<
FAILURE! - in org.apache.hadoop.mapreduce.v2.TestMRJobs
> testJobWithChangePriority(org.apache.hadoop.mapreduce.v2.TestMRJobs)  Time elapsed: 21.477
sec  <<< FAILURE!
> java.lang.AssertionError: expected:<DEFAULT> but was:<HIGH>
> 	at org.junit.Assert.fail(Assert.java:88)
> 	at org.junit.Assert.failNotEquals(Assert.java:743)
> 	at org.junit.Assert.assertEquals(Assert.java:118)
> 	at org.junit.Assert.assertEquals(Assert.java:144)
> 	at org.apache.hadoop.mapreduce.v2.TestMRJobs.testJobWithChangePriority(TestMRJobs.java:276)
> {noformat}



--
This message was sent by Atlassian JIRA
(v6.3.4#6332)

Mime
View raw message