hadoop-yarn-issues mailing list archives

Site index · List index
Message view « Date » · « Thread »
Top « Date » · « Thread »
From "Hadoop QA (JIRA)" <j...@apache.org>
Subject [jira] [Commented] (YARN-4556) TestFifoScheduler.testResourceOverCommit fails
Date Fri, 22 Apr 2016 23:06:13 GMT

    [ https://issues.apache.org/jira/browse/YARN-4556?page=com.atlassian.jira.plugin.system.issuetabpanels:comment-tabpanel&focusedCommentId=15254872#comment-15254872
] 

Hadoop QA commented on YARN-4556:
---------------------------------

| (x) *{color:red}-1 overall{color}* |
\\
\\
|| Vote || Subsystem || Runtime || Comment ||
| {color:blue}0{color} | {color:blue} reexec {color} | {color:blue} 8m 59s {color} | {color:blue}
Docker mode activated. {color} |
| {color:green}+1{color} | {color:green} @author {color} | {color:green} 0m 0s {color} | {color:green}
The patch does not contain any @author tags. {color} |
| {color:green}+1{color} | {color:green} test4tests {color} | {color:green} 0m 0s {color}
| {color:green} The patch appears to include 2 new or modified test files. {color} |
| {color:green}+1{color} | {color:green} mvninstall {color} | {color:green} 8m 15s {color}
| {color:green} branch-2.7 passed {color} |
| {color:green}+1{color} | {color:green} compile {color} | {color:green} 0m 23s {color} |
{color:green} branch-2.7 passed with JDK v1.8.0_77 {color} |
| {color:green}+1{color} | {color:green} compile {color} | {color:green} 0m 26s {color} |
{color:green} branch-2.7 passed with JDK v1.7.0_95 {color} |
| {color:green}+1{color} | {color:green} checkstyle {color} | {color:green} 0m 22s {color}
| {color:green} branch-2.7 passed {color} |
| {color:green}+1{color} | {color:green} mvnsite {color} | {color:green} 0m 35s {color} |
{color:green} branch-2.7 passed {color} |
| {color:green}+1{color} | {color:green} mvneclipse {color} | {color:green} 0m 17s {color}
| {color:green} branch-2.7 passed {color} |
| {color:red}-1{color} | {color:red} findbugs {color} | {color:red} 1m 11s {color} | {color:red}
hadoop-yarn-project/hadoop-yarn/hadoop-yarn-server/hadoop-yarn-server-resourcemanager in branch-2.7
has 1 extant Findbugs warnings. {color} |
| {color:green}+1{color} | {color:green} javadoc {color} | {color:green} 0m 20s {color} |
{color:green} branch-2.7 passed with JDK v1.8.0_77 {color} |
| {color:green}+1{color} | {color:green} javadoc {color} | {color:green} 0m 23s {color} |
{color:green} branch-2.7 passed with JDK v1.7.0_95 {color} |
| {color:green}+1{color} | {color:green} mvninstall {color} | {color:green} 0m 27s {color}
| {color:green} the patch passed {color} |
| {color:green}+1{color} | {color:green} compile {color} | {color:green} 0m 21s {color} |
{color:green} the patch passed with JDK v1.8.0_77 {color} |
| {color:green}+1{color} | {color:green} javac {color} | {color:green} 0m 21s {color} | {color:green}
the patch passed {color} |
| {color:green}+1{color} | {color:green} compile {color} | {color:green} 0m 24s {color} |
{color:green} the patch passed with JDK v1.7.0_95 {color} |
| {color:green}+1{color} | {color:green} javac {color} | {color:green} 0m 24s {color} | {color:green}
the patch passed {color} |
| {color:green}+1{color} | {color:green} checkstyle {color} | {color:green} 0m 14s {color}
| {color:green} the patch passed {color} |
| {color:green}+1{color} | {color:green} mvnsite {color} | {color:green} 0m 29s {color} |
{color:green} the patch passed {color} |
| {color:green}+1{color} | {color:green} mvneclipse {color} | {color:green} 0m 11s {color}
| {color:green} the patch passed {color} |
| {color:red}-1{color} | {color:red} whitespace {color} | {color:red} 0m 0s {color} | {color:red}
The patch has 1890 line(s) that end in whitespace. Use git apply --whitespace=fix. {color}
|
| {color:red}-1{color} | {color:red} whitespace {color} | {color:red} 0m 49s {color} | {color:red}
The patch has 256 line(s) with tabs. {color} |
| {color:green}+1{color} | {color:green} findbugs {color} | {color:green} 1m 11s {color} |
{color:green} the patch passed {color} |
| {color:green}+1{color} | {color:green} javadoc {color} | {color:green} 0m 16s {color} |
{color:green} the patch passed with JDK v1.8.0_77 {color} |
| {color:green}+1{color} | {color:green} javadoc {color} | {color:green} 0m 21s {color} |
{color:green} the patch passed with JDK v1.7.0_95 {color} |
| {color:red}-1{color} | {color:red} unit {color} | {color:red} 49m 32s {color} | {color:red}
hadoop-yarn-server-resourcemanager in the patch failed with JDK v1.8.0_77. {color} |
| {color:red}-1{color} | {color:red} unit {color} | {color:red} 50m 18s {color} | {color:red}
hadoop-yarn-server-resourcemanager in the patch failed with JDK v1.7.0_95. {color} |
| {color:red}-1{color} | {color:red} asflicense {color} | {color:red} 2m 16s {color} | {color:red}
Patch generated 61 ASF License warnings. {color} |
| {color:black}{color} | {color:black} {color} | {color:black} 129m 23s {color} | {color:black}
{color} |
\\
\\
|| Reason || Tests ||
| JDK v1.8.0_77 Failed junit tests | hadoop.yarn.server.resourcemanager.TestClientRMTokens
|
|   | hadoop.yarn.server.resourcemanager.TestAMAuthorization |
| JDK v1.7.0_95 Failed junit tests | hadoop.yarn.server.resourcemanager.TestClientRMTokens
|
|   | hadoop.yarn.server.resourcemanager.TestAMAuthorization |
\\
\\
|| Subsystem || Report/Notes ||
| Docker |  Image:yetus/hadoop:c420dfe |
| JIRA Patch URL | https://issues.apache.org/jira/secure/attachment/12800290/YARN-4556-branch-2.7.001.patch
|
| JIRA Issue | YARN-4556 |
| Optional Tests |  asflicense  compile  javac  javadoc  mvninstall  mvnsite  unit  findbugs
 checkstyle  |
| uname | Linux e4b37f62bbc3 3.13.0-36-lowlatency #63-Ubuntu SMP PREEMPT Wed Sep 3 21:56:12
UTC 2014 x86_64 x86_64 x86_64 GNU/Linux |
| Build tool | maven |
| Personality | /testptch/hadoop/patchprocess/precommit/personality/provided.sh |
| git revision | branch-2.7 / 0bb23e2 |
| Default Java | 1.7.0_95 |
| Multi-JDK versions |  /usr/lib/jvm/java-8-oracle:1.8.0_77 /usr/lib/jvm/java-7-openjdk-amd64:1.7.0_95
|
| findbugs | v3.0.0 |
| findbugs | https://builds.apache.org/job/PreCommit-YARN-Build/11184/artifact/patchprocess/branch-findbugs-hadoop-yarn-project_hadoop-yarn_hadoop-yarn-server_hadoop-yarn-server-resourcemanager-warnings.html
|
| whitespace | https://builds.apache.org/job/PreCommit-YARN-Build/11184/artifact/patchprocess/whitespace-eol.txt
|
| whitespace | https://builds.apache.org/job/PreCommit-YARN-Build/11184/artifact/patchprocess/whitespace-tabs.txt
|
| unit | https://builds.apache.org/job/PreCommit-YARN-Build/11184/artifact/patchprocess/patch-unit-hadoop-yarn-project_hadoop-yarn_hadoop-yarn-server_hadoop-yarn-server-resourcemanager-jdk1.8.0_77.txt
|
| unit | https://builds.apache.org/job/PreCommit-YARN-Build/11184/artifact/patchprocess/patch-unit-hadoop-yarn-project_hadoop-yarn_hadoop-yarn-server_hadoop-yarn-server-resourcemanager-jdk1.7.0_95.txt
|
| unit test logs |  https://builds.apache.org/job/PreCommit-YARN-Build/11184/artifact/patchprocess/patch-unit-hadoop-yarn-project_hadoop-yarn_hadoop-yarn-server_hadoop-yarn-server-resourcemanager-jdk1.8.0_77.txt
https://builds.apache.org/job/PreCommit-YARN-Build/11184/artifact/patchprocess/patch-unit-hadoop-yarn-project_hadoop-yarn_hadoop-yarn-server_hadoop-yarn-server-resourcemanager-jdk1.7.0_95.txt
|
| JDK v1.7.0_95  Test Results | https://builds.apache.org/job/PreCommit-YARN-Build/11184/testReport/
|
| asflicense | https://builds.apache.org/job/PreCommit-YARN-Build/11184/artifact/patchprocess/patch-asflicense-problems.txt
|
| modules | C: hadoop-yarn-project/hadoop-yarn/hadoop-yarn-server/hadoop-yarn-server-resourcemanager
U: hadoop-yarn-project/hadoop-yarn/hadoop-yarn-server/hadoop-yarn-server-resourcemanager |
| Console output | https://builds.apache.org/job/PreCommit-YARN-Build/11184/console |
| Powered by | Apache Yetus 0.2.0   http://yetus.apache.org |


This message was automatically generated.



>  TestFifoScheduler.testResourceOverCommit fails
> -----------------------------------------------
>
>                 Key: YARN-4556
>                 URL: https://issues.apache.org/jira/browse/YARN-4556
>             Project: Hadoop YARN
>          Issue Type: Sub-task
>          Components: scheduler
>            Reporter: Akihiro Suda
>            Assignee: Akihiro Suda
>             Fix For: 2.8.0
>
>         Attachments: YARN-4556-1.patch, YARN-4556-branch-2.7.001.patch
>
>
> From YARN-4548 Jenkins log: https://builds.apache.org/job/PreCommit-YARN-Build/10181/artifact/patchprocess/patch-unit-hadoop-yarn-project_hadoop-yarn_hadoop-yarn-server_hadoop-yarn-server-resourcemanager-jdk1.8.0_66.txt
> {code}
> Running org.apache.hadoop.yarn.server.resourcemanager.scheduler.fifo.TestFifoScheduler
> Tests run: 16, Failures: 1, Errors: 0, Skipped: 0, Time elapsed: 31.004 sec <<<
FAILURE! - in org.apache.hadoop.yarn.server.resourcemanager.scheduler.fifo.TestFifoScheduler
> testResourceOverCommit(org.apache.hadoop.yarn.server.resourcemanager.scheduler.fifo.TestFifoScheduler)
 Time elapsed: 4.746 sec  <<< FAILURE!
> java.lang.AssertionError: expected:<-2048> but was:<0>
> 	at org.junit.Assert.fail(Assert.java:88)
> 	at org.junit.Assert.failNotEquals(Assert.java:743)
> 	at org.junit.Assert.assertEquals(Assert.java:118)
> 	at org.junit.Assert.assertEquals(Assert.java:555)
> 	at org.junit.Assert.assertEquals(Assert.java:542)
> 	at org.apache.hadoop.yarn.server.resourcemanager.scheduler.fifo.TestFifoScheduler.testResourceOverCommit(TestFifoScheduler.java:1142)
> {code}
> https://github.com/apache/hadoop/blob/8676a118a12165ae5a8b80a2a4596c133471ebc1/hadoop-yarn-project/hadoop-yarn/hadoop-yarn-server/hadoop-yarn-server-resourcemanager/src/test/java/org/apache/hadoop/yarn/server/resourcemanager/scheduler/fifo/TestFifoScheduler.java#L1142
> It seems that Jenkins has been hitting this intermittently since April 2015
> https://www.google.com/search?q=TestFifoScheduler.testResourceOverCommit



--
This message was sent by Atlassian JIRA
(v6.3.4#6332)

Mime
View raw message