hadoop-yarn-issues mailing list archives

Site index · List index
Message view « Date » · « Thread »
Top « Date » · « Thread »
From "Hadoop QA (JIRA)" <j...@apache.org>
Subject [jira] [Commented] (YARN-4613) TestClientRMService#testGetClusterNodes fails occasionally
Date Sun, 24 Jan 2016 10:38:40 GMT

    [ https://issues.apache.org/jira/browse/YARN-4613?page=com.atlassian.jira.plugin.system.issuetabpanels:comment-tabpanel&focusedCommentId=15114267#comment-15114267
] 

Hadoop QA commented on YARN-4613:
---------------------------------

| (x) *{color:red}-1 overall{color}* |
\\
\\
|| Vote || Subsystem || Runtime || Comment ||
| {color:blue}0{color} | {color:blue} reexec {color} | {color:blue} 0m 0s {color} | {color:blue}
Docker mode activated. {color} |
| {color:green}+1{color} | {color:green} @author {color} | {color:green} 0m 0s {color} | {color:green}
The patch does not contain any @author tags. {color} |
| {color:green}+1{color} | {color:green} test4tests {color} | {color:green} 0m 0s {color}
| {color:green} The patch appears to include 1 new or modified test files. {color} |
| {color:green}+1{color} | {color:green} mvninstall {color} | {color:green} 7m 38s {color}
| {color:green} trunk passed {color} |
| {color:green}+1{color} | {color:green} compile {color} | {color:green} 0m 26s {color} |
{color:green} trunk passed with JDK v1.8.0_66 {color} |
| {color:green}+1{color} | {color:green} compile {color} | {color:green} 0m 30s {color} |
{color:green} trunk passed with JDK v1.7.0_91 {color} |
| {color:green}+1{color} | {color:green} checkstyle {color} | {color:green} 0m 13s {color}
| {color:green} trunk passed {color} |
| {color:green}+1{color} | {color:green} mvnsite {color} | {color:green} 0m 36s {color} |
{color:green} trunk passed {color} |
| {color:green}+1{color} | {color:green} mvneclipse {color} | {color:green} 0m 15s {color}
| {color:green} trunk passed {color} |
| {color:green}+1{color} | {color:green} findbugs {color} | {color:green} 1m 10s {color} |
{color:green} trunk passed {color} |
| {color:green}+1{color} | {color:green} javadoc {color} | {color:green} 0m 21s {color} |
{color:green} trunk passed with JDK v1.8.0_66 {color} |
| {color:green}+1{color} | {color:green} javadoc {color} | {color:green} 0m 27s {color} |
{color:green} trunk passed with JDK v1.7.0_91 {color} |
| {color:green}+1{color} | {color:green} mvninstall {color} | {color:green} 0m 31s {color}
| {color:green} the patch passed {color} |
| {color:green}+1{color} | {color:green} compile {color} | {color:green} 0m 23s {color} |
{color:green} the patch passed with JDK v1.8.0_66 {color} |
| {color:green}+1{color} | {color:green} javac {color} | {color:green} 0m 23s {color} | {color:green}
the patch passed {color} |
| {color:green}+1{color} | {color:green} compile {color} | {color:green} 0m 28s {color} |
{color:green} the patch passed with JDK v1.7.0_91 {color} |
| {color:green}+1{color} | {color:green} javac {color} | {color:green} 0m 28s {color} | {color:green}
the patch passed {color} |
| {color:green}+1{color} | {color:green} checkstyle {color} | {color:green} 0m 12s {color}
| {color:green} the patch passed {color} |
| {color:green}+1{color} | {color:green} mvnsite {color} | {color:green} 0m 34s {color} |
{color:green} the patch passed {color} |
| {color:green}+1{color} | {color:green} mvneclipse {color} | {color:green} 0m 12s {color}
| {color:green} the patch passed {color} |
| {color:green}+1{color} | {color:green} whitespace {color} | {color:green} 0m 0s {color}
| {color:green} Patch has no whitespace issues. {color} |
| {color:green}+1{color} | {color:green} findbugs {color} | {color:green} 1m 21s {color} |
{color:green} the patch passed {color} |
| {color:green}+1{color} | {color:green} javadoc {color} | {color:green} 0m 19s {color} |
{color:green} the patch passed with JDK v1.8.0_66 {color} |
| {color:green}+1{color} | {color:green} javadoc {color} | {color:green} 0m 24s {color} |
{color:green} the patch passed with JDK v1.7.0_91 {color} |
| {color:red}-1{color} | {color:red} unit {color} | {color:red} 65m 44s {color} | {color:red}
hadoop-yarn-server-resourcemanager in the patch failed with JDK v1.8.0_66. {color} |
| {color:red}-1{color} | {color:red} unit {color} | {color:red} 66m 51s {color} | {color:red}
hadoop-yarn-server-resourcemanager in the patch failed with JDK v1.7.0_91. {color} |
| {color:green}+1{color} | {color:green} asflicense {color} | {color:green} 0m 17s {color}
| {color:green} Patch does not generate ASF License warnings. {color} |
| {color:black}{color} | {color:black} {color} | {color:black} 149m 55s {color} | {color:black}
{color} |
\\
\\
|| Reason || Tests ||
| JDK v1.8.0_66 Failed junit tests | hadoop.yarn.server.resourcemanager.TestClientRMTokens
|
|   | hadoop.yarn.server.resourcemanager.TestAMAuthorization |
| JDK v1.7.0_91 Failed junit tests | hadoop.yarn.server.resourcemanager.TestClientRMTokens
|
|   | hadoop.yarn.server.resourcemanager.TestAMAuthorization |
\\
\\
|| Subsystem || Report/Notes ||
| Docker |  Image:yetus/hadoop:0ca8df7 |
| JIRA Patch URL | https://issues.apache.org/jira/secure/attachment/12784051/YARN-4613.2.patch
|
| JIRA Issue | YARN-4613 |
| Optional Tests |  asflicense  compile  javac  javadoc  mvninstall  mvnsite  unit  findbugs
 checkstyle  |
| uname | Linux 0497f7c09e08 3.13.0-36-lowlatency #63-Ubuntu SMP PREEMPT Wed Sep 3 21:56:12
UTC 2014 x86_64 x86_64 x86_64 GNU/Linux |
| Build tool | maven |
| Personality | /testptch/hadoop/patchprocess/precommit/personality/provided.sh |
| git revision | trunk / 99829eb |
| Default Java | 1.7.0_91 |
| Multi-JDK versions |  /usr/lib/jvm/java-8-oracle:1.8.0_66 /usr/lib/jvm/java-7-openjdk-amd64:1.7.0_91
|
| findbugs | v3.0.0 |
| unit | https://builds.apache.org/job/PreCommit-YARN-Build/10375/artifact/patchprocess/patch-unit-hadoop-yarn-project_hadoop-yarn_hadoop-yarn-server_hadoop-yarn-server-resourcemanager-jdk1.8.0_66.txt
|
| unit | https://builds.apache.org/job/PreCommit-YARN-Build/10375/artifact/patchprocess/patch-unit-hadoop-yarn-project_hadoop-yarn_hadoop-yarn-server_hadoop-yarn-server-resourcemanager-jdk1.7.0_91.txt
|
| unit test logs |  https://builds.apache.org/job/PreCommit-YARN-Build/10375/artifact/patchprocess/patch-unit-hadoop-yarn-project_hadoop-yarn_hadoop-yarn-server_hadoop-yarn-server-resourcemanager-jdk1.8.0_66.txt
https://builds.apache.org/job/PreCommit-YARN-Build/10375/artifact/patchprocess/patch-unit-hadoop-yarn-project_hadoop-yarn_hadoop-yarn-server_hadoop-yarn-server-resourcemanager-jdk1.7.0_91.txt
|
| JDK v1.7.0_91  Test Results | https://builds.apache.org/job/PreCommit-YARN-Build/10375/testReport/
|
| modules | C: hadoop-yarn-project/hadoop-yarn/hadoop-yarn-server/hadoop-yarn-server-resourcemanager
U: hadoop-yarn-project/hadoop-yarn/hadoop-yarn-server/hadoop-yarn-server-resourcemanager |
| Max memory used | 77MB |
| Powered by | Apache Yetus 0.2.0-SNAPSHOT   http://yetus.apache.org |
| Console output | https://builds.apache.org/job/PreCommit-YARN-Build/10375/console |


This message was automatically generated.



> TestClientRMService#testGetClusterNodes fails occasionally
> ----------------------------------------------------------
>
>                 Key: YARN-4613
>                 URL: https://issues.apache.org/jira/browse/YARN-4613
>             Project: Hadoop YARN
>          Issue Type: Sub-task
>          Components: test
>         Environment: jenkins
>            Reporter: Jason Lowe
>            Assignee: Takashi Ohnishi
>         Attachments: YARN-4613.1.patch, YARN-4613.2.patch
>
>
> TestClientRMService has been failing occasionally on precommits.  Sample failure:
> {noformat}
> Java HotSpot(TM) 64-Bit Server VM warning: ignoring option MaxPermSize=768m; support
was removed in 8.0
> Running org.apache.hadoop.yarn.server.resourcemanager.TestClientRMService
> Tests run: 19, Failures: 1, Errors: 0, Skipped: 0, Time elapsed: 15.077 sec <<<
FAILURE! - in org.apache.hadoop.yarn.server.resourcemanager.TestClientRMService
> testGetClusterNodes(org.apache.hadoop.yarn.server.resourcemanager.TestClientRMService)
 Time elapsed: 0.551 sec  <<< FAILURE!
> java.lang.AssertionError: Unhealthy nodes should not show up by default expected:<0>
but was:<1>
> 	at org.junit.Assert.fail(Assert.java:88)
> 	at org.junit.Assert.failNotEquals(Assert.java:743)
> 	at org.junit.Assert.assertEquals(Assert.java:118)
> 	at org.junit.Assert.assertEquals(Assert.java:555)
> 	at org.apache.hadoop.yarn.server.resourcemanager.TestClientRMService.testGetClusterNodes(TestClientRMService.java:215)
> {noformat}



--
This message was sent by Atlassian JIRA
(v6.3.4#6332)

Mime
View raw message