hadoop-yarn-issues mailing list archives

Site index · List index
Message view « Date » · « Thread »
Top « Date » · « Thread »
From "Takashi Ohnishi (JIRA)" <j...@apache.org>
Subject [jira] [Updated] (YARN-4572) TestCapacityScheduler#testHeadRoomCalculationWithDRC failing
Date Wed, 27 Jan 2016 04:57:39 GMT

     [ https://issues.apache.org/jira/browse/YARN-4572?page=com.atlassian.jira.plugin.system.issuetabpanels:all-tabpanel
]

Takashi Ohnishi updated YARN-4572:
----------------------------------
    Attachment: YARN-4572.1.patch

> TestCapacityScheduler#testHeadRoomCalculationWithDRC failing
> ------------------------------------------------------------
>
>                 Key: YARN-4572
>                 URL: https://issues.apache.org/jira/browse/YARN-4572
>             Project: Hadoop YARN
>          Issue Type: Sub-task
>          Components: yarn
>            Reporter: Bibin A Chundatt
>         Attachments: YARN-4572.1.patch
>
>
> {noformat}
> Tests run: 46, Failures: 1, Errors: 0, Skipped: 0, Time elapsed: 127.996 sec <<<
FAILURE! - in org.apache.hadoop.yarn.server.resourcemanager.scheduler.capacity.TestCapacityScheduler
> testHeadRoomCalculationWithDRC(org.apache.hadoop.yarn.server.resourcemanager.scheduler.capacity.TestCapacityScheduler)
 Time elapsed: 0.189 sec  <<< FAILURE!
> java.lang.AssertionError: expected:<6144> but was:<16384>
> 	at org.junit.Assert.fail(Assert.java:88)
> 	at org.junit.Assert.failNotEquals(Assert.java:743)
> 	at org.junit.Assert.assertEquals(Assert.java:118)
> 	at org.junit.Assert.assertEquals(Assert.java:555)
> 	at org.junit.Assert.assertEquals(Assert.java:542)
> 	at org.apache.hadoop.yarn.server.resourcemanager.scheduler.capacity.TestCapacityScheduler.testHeadRoomCalculationWithDRC(TestCapacityScheduler.java:3041)
> {noformat}
> https://builds.apache.org/job/PreCommit-YARN-Build/10204/artifact/patchprocess/patch-unit-hadoop-yarn-project_hadoop-yarn_hadoop-yarn-server_hadoop-yarn-server-resourcemanager-jdk1.8.0_66.txt
> https://builds.apache.org/job/PreCommit-YARN-Build/10204/testReport/
> Failed in jdk8 locally the same is passing



--
This message was sent by Atlassian JIRA
(v6.3.4#6332)

Mime
View raw message