hadoop-yarn-issues mailing list archives

Site index · List index
Message view « Date » · « Thread »
Top « Date » · « Thread »
From "Hadoop QA (JIRA)" <j...@apache.org>
Subject [jira] [Commented] (YARN-4379) TestWebApp failing in trunk
Date Sat, 21 Nov 2015 10:44:11 GMT

    [ https://issues.apache.org/jira/browse/YARN-4379?page=com.atlassian.jira.plugin.system.issuetabpanels:comment-tabpanel&focusedCommentId=15020386#comment-15020386
] 

Hadoop QA commented on YARN-4379:
---------------------------------

| (x) *{color:red}-1 overall{color}* |
\\
\\
|| Vote || Subsystem || Runtime || Comment ||
| {color:blue}0{color} | {color:blue} reexec {color} | {color:blue} 0m 0s {color} | {color:blue}
Docker mode activated. {color} |
| {color:green}+1{color} | {color:green} @author {color} | {color:green} 0m 0s {color} | {color:green}
The patch does not contain any @author tags. {color} |
| {color:green}+1{color} | {color:green} test4tests {color} | {color:green} 0m 0s {color}
| {color:green} The patch appears to include 1 new or modified test files. {color} |
| {color:green}+1{color} | {color:green} mvninstall {color} | {color:green} 9m 5s {color}
| {color:green} trunk passed {color} |
| {color:green}+1{color} | {color:green} compile {color} | {color:green} 0m 34s {color} |
{color:green} trunk passed with JDK v1.8.0_66 {color} |
| {color:green}+1{color} | {color:green} compile {color} | {color:green} 0m 34s {color} |
{color:green} trunk passed with JDK v1.7.0_85 {color} |
| {color:green}+1{color} | {color:green} checkstyle {color} | {color:green} 0m 18s {color}
| {color:green} trunk passed {color} |
| {color:green}+1{color} | {color:green} mvnsite {color} | {color:green} 0m 38s {color} |
{color:green} trunk passed {color} |
| {color:green}+1{color} | {color:green} mvneclipse {color} | {color:green} 0m 14s {color}
| {color:green} trunk passed {color} |
| {color:red}-1{color} | {color:red} findbugs {color} | {color:red} 1m 36s {color} | {color:red}
hadoop-yarn-project/hadoop-yarn/hadoop-yarn-common in trunk has 3 extant Findbugs warnings.
{color} |
| {color:green}+1{color} | {color:green} javadoc {color} | {color:green} 0m 39s {color} |
{color:green} trunk passed with JDK v1.8.0_66 {color} |
| {color:green}+1{color} | {color:green} javadoc {color} | {color:green} 0m 43s {color} |
{color:green} trunk passed with JDK v1.7.0_85 {color} |
| {color:green}+1{color} | {color:green} mvninstall {color} | {color:green} 0m 38s {color}
| {color:green} the patch passed {color} |
| {color:green}+1{color} | {color:green} compile {color} | {color:green} 0m 34s {color} |
{color:green} the patch passed with JDK v1.8.0_66 {color} |
| {color:green}+1{color} | {color:green} javac {color} | {color:green} 0m 35s {color} | {color:green}
the patch passed {color} |
| {color:green}+1{color} | {color:green} compile {color} | {color:green} 0m 35s {color} |
{color:green} the patch passed with JDK v1.7.0_85 {color} |
| {color:green}+1{color} | {color:green} javac {color} | {color:green} 0m 35s {color} | {color:green}
the patch passed {color} |
| {color:green}+1{color} | {color:green} checkstyle {color} | {color:green} 0m 19s {color}
| {color:green} the patch passed {color} |
| {color:green}+1{color} | {color:green} mvnsite {color} | {color:green} 0m 41s {color} |
{color:green} the patch passed {color} |
| {color:green}+1{color} | {color:green} mvneclipse {color} | {color:green} 0m 16s {color}
| {color:green} the patch passed {color} |
| {color:green}+1{color} | {color:green} whitespace {color} | {color:green} 0m 0s {color}
| {color:green} Patch has no whitespace issues. {color} |
| {color:green}+1{color} | {color:green} findbugs {color} | {color:green} 1m 52s {color} |
{color:green} the patch passed {color} |
| {color:green}+1{color} | {color:green} javadoc {color} | {color:green} 0m 35s {color} |
{color:green} the patch passed with JDK v1.8.0_66 {color} |
| {color:green}+1{color} | {color:green} javadoc {color} | {color:green} 0m 37s {color} |
{color:green} the patch passed with JDK v1.7.0_85 {color} |
| {color:green}+1{color} | {color:green} unit {color} | {color:green} 2m 23s {color} | {color:green}
hadoop-yarn-common in the patch passed with JDK v1.8.0_66. {color} |
| {color:green}+1{color} | {color:green} unit {color} | {color:green} 2m 28s {color} | {color:green}
hadoop-yarn-common in the patch passed with JDK v1.7.0_85. {color} |
| {color:green}+1{color} | {color:green} asflicense {color} | {color:green} 0m 26s {color}
| {color:green} Patch does not generate ASF License warnings. {color} |
| {color:black}{color} | {color:black} {color} | {color:black} 44m 35s {color} | {color:black}
{color} |
\\
\\
|| Subsystem || Report/Notes ||
| Docker |  Image:yetus/hadoop:0ca8df7 |
| JIRA Patch URL | https://issues.apache.org/jira/secure/attachment/12773647/YARN-4379.01.patch
|
| JIRA Issue | YARN-4379 |
| Optional Tests |  asflicense  compile  javac  javadoc  mvninstall  mvnsite  unit  findbugs
 checkstyle  |
| uname | Linux 4e1c78d37578 3.13.0-36-lowlatency #63-Ubuntu SMP PREEMPT Wed Sep 3 21:56:12
UTC 2014 x86_64 x86_64 x86_64 GNU/Linux |
| Build tool | maven |
| Personality | /testptch/hadoop/patchprocess/precommit/personality/provided.sh |
| git revision | trunk / a30eccb |
| findbugs | v3.0.0 |
| findbugs | https://builds.apache.org/job/PreCommit-YARN-Build/9753/artifact/patchprocess/branch-findbugs-hadoop-yarn-project_hadoop-yarn_hadoop-yarn-common-warnings.html
|
| JDK v1.7.0_85  Test Results | https://builds.apache.org/job/PreCommit-YARN-Build/9753/testReport/
|
| modules | C: hadoop-yarn-project/hadoop-yarn/hadoop-yarn-common U: hadoop-yarn-project/hadoop-yarn/hadoop-yarn-common
|
| Max memory used | 76MB |
| Powered by | Apache Yetus   http://yetus.apache.org |
| Console output | https://builds.apache.org/job/PreCommit-YARN-Build/9753/console |


This message was automatically generated.



> TestWebApp failing in trunk
> ---------------------------
>
>                 Key: YARN-4379
>                 URL: https://issues.apache.org/jira/browse/YARN-4379
>             Project: Hadoop YARN
>          Issue Type: Bug
>    Affects Versions: 2.7.1
>            Reporter: Varun Saxena
>            Assignee: Varun Saxena
>         Attachments: YARN-4379.01.patch
>
>
> {noformat}
> Tests run: 9, Failures: 0, Errors: 1, Skipped: 0, Time elapsed: 4.917 sec <<<
FAILURE! - in org.apache.hadoop.yarn.webapp.TestWebApp
> testYARNWebAppContext(org.apache.hadoop.yarn.webapp.TestWebApp)  Time elapsed: 1.828
sec  <<< ERROR!
> java.lang.RuntimeException: java.io.IOException: Server returned HTTP response code:
403 for URL: http://localhost:57512/static/
> 	at sun.net.www.protocol.http.HttpURLConnection.getInputStream(HttpURLConnection.java:1628)
> 	at org.apache.hadoop.yarn.webapp.TestWebApp.getContent(TestWebApp.java:293)
> 	at org.apache.hadoop.yarn.webapp.TestWebApp.testYARNWebAppContext(TestWebApp.java:276)
> {noformat}



--
This message was sent by Atlassian JIRA
(v6.3.4#6332)

Mime
View raw message