hadoop-yarn-issues mailing list archives

Site index · List index
Message view « Date » · « Thread »
Top « Date » · « Thread »
From "Hadoop QA (JIRA)" <j...@apache.org>
Subject [jira] [Commented] (YARN-4297) TestJobHistoryEventHandler and TestRMContainerAllocator failing on YARN-2928 branch
Date Sun, 25 Oct 2015 18:27:27 GMT

    [ https://issues.apache.org/jira/browse/YARN-4297?page=com.atlassian.jira.plugin.system.issuetabpanels:comment-tabpanel&focusedCommentId=14973363#comment-14973363
] 

Hadoop QA commented on YARN-4297:
---------------------------------

\\
\\
| (x) *{color:red}-1 overall{color}* |
\\
\\
|| Vote || Subsystem || Runtime || Comment ||
| {color:red}-1{color} | pre-patch |  22m 31s | Findbugs (version ) appears to be broken on
YARN-2928. |
| {color:green}+1{color} | @author |   0m  0s | The patch does not contain any @author tags.
|
| {color:green}+1{color} | tests included |   0m  0s | The patch appears to include 2 new
or modified test files. |
| {color:green}+1{color} | javac |  10m 28s | There were no new javac warning messages. |
| {color:green}+1{color} | javadoc |  13m 33s | There were no new javadoc warning messages.
|
| {color:red}-1{color} | release audit |   0m 24s | The applied patch generated 1 release
audit warnings. |
| {color:green}+1{color} | checkstyle |   0m 41s | There were no new checkstyle issues. |
| {color:green}+1{color} | whitespace |   0m  0s | The patch has no lines that end in whitespace.
|
| {color:green}+1{color} | install |   2m  8s | mvn install still works. |
| {color:green}+1{color} | eclipse:eclipse |   0m 57s | The patch built with eclipse:eclipse.
|
| {color:green}+1{color} | findbugs |   3m 39s | The patch does not introduce any new Findbugs
(version 3.0.0) warnings. |
| {color:green}+1{color} | mapreduce tests |  11m 11s | Tests passed in hadoop-mapreduce-client-app.
|
| {color:green}+1{color} | yarn tests |  61m 59s | Tests passed in hadoop-yarn-server-resourcemanager.
|
| | | 127m 37s | |
\\
\\
|| Subsystem || Report/Notes ||
| Patch URL | http://issues.apache.org/jira/secure/attachment/12768613/YARN-4297-YARN-2928.02.patch
|
| Optional Tests | javac unit findbugs checkstyle javadoc |
| git revision | YARN-2928 / 3c4e424 |
| Release Audit | https://builds.apache.org/job/PreCommit-YARN-Build/9570/artifact/patchprocess/patchReleaseAuditProblems.txt
|
| hadoop-mapreduce-client-app test log | https://builds.apache.org/job/PreCommit-YARN-Build/9570/artifact/patchprocess/testrun_hadoop-mapreduce-client-app.txt
|
| hadoop-yarn-server-resourcemanager test log | https://builds.apache.org/job/PreCommit-YARN-Build/9570/artifact/patchprocess/testrun_hadoop-yarn-server-resourcemanager.txt
|
| Test Results | https://builds.apache.org/job/PreCommit-YARN-Build/9570/testReport/ |
| Java | 1.7.0_55 |
| uname | Linux asf906.gq1.ygridcore.net 3.13.0-36-lowlatency #63-Ubuntu SMP PREEMPT Wed Sep
3 21:56:12 UTC 2014 x86_64 x86_64 x86_64 GNU/Linux |
| Console output | https://builds.apache.org/job/PreCommit-YARN-Build/9570/console |


This message was automatically generated.

> TestJobHistoryEventHandler and TestRMContainerAllocator failing on YARN-2928 branch
> -----------------------------------------------------------------------------------
>
>                 Key: YARN-4297
>                 URL: https://issues.apache.org/jira/browse/YARN-4297
>             Project: Hadoop YARN
>          Issue Type: Sub-task
>    Affects Versions: YARN-2928
>            Reporter: Varun Saxena
>            Assignee: Varun Saxena
>         Attachments: YARN-4297-YARN-2928.01.patch, YARN-4297-YARN-2928.02.patch
>
>
> {noformat}
> Tests run: 13, Failures: 0, Errors: 1, Skipped: 0, Time elapsed: 16.09 sec <<<
FAILURE! - in org.apache.hadoop.mapreduce.jobhistory.TestJobHistoryEventHandler
> testTimelineEventHandling(org.apache.hadoop.mapreduce.jobhistory.TestJobHistoryEventHandler)
 Time elapsed: 0.11 sec  <<< ERROR!
> java.lang.ClassCastException: org.apache.hadoop.mapreduce.v2.app.AppContext$$EnhancerByMockitoWithCGLIB$$95d3ddbe
cannot be cast to org.apache.hadoop.mapreduce.v2.app.MRAppMaster$RunningAppContext
> 	at org.apache.hadoop.mapreduce.jobhistory.JobHistoryEventHandler.serviceInit(JobHistoryEventHandler.java:271)
> 	at org.apache.hadoop.service.AbstractService.init(AbstractService.java:163)
> 	at org.apache.hadoop.mapreduce.jobhistory.TestJobHistoryEventHandler.testTimelineEventHandling(TestJobHistoryEventHandler.java:495)
> {noformat}
> {noformat}
> testRMContainerAllocatorResendsRequestsOnRMRestart(org.apache.hadoop.mapreduce.v2.app.rm.TestRMContainerAllocator)
 Time elapsed: 2.649 sec  <<< ERROR!
> java.lang.ClassCastException: org.apache.hadoop.mapreduce.v2.app.AppContext$$EnhancerByMockitoWithCGLIB$$8e08559a
cannot be cast to org.apache.hadoop.mapreduce.v2.app.MRAppMaster$RunningAppContext
> 	at org.apache.hadoop.mapreduce.v2.app.rm.RMContainerAllocator.getResources(RMContainerAllocator.java:802)
> 	at org.apache.hadoop.mapreduce.v2.app.rm.RMContainerAllocator.heartbeat(RMContainerAllocator.java:269)
> Tests in error: 
>   TestRMContainerAllocator.testExcessReduceContainerAssign:669 » ClassCast org.a...
>   TestRMContainerAllocator.testReportedAppProgress:970 » NullPointer
>   TestRMContainerAllocator.testBlackListedNodesWithSchedulingToThatNode:1578 » ClassCast
>   TestRMContainerAllocator.testBlackListedNodes:1292 » ClassCast org.apache.hado...
>   TestRMContainerAllocator.testAMRMTokenUpdate:2691 » ClassCast org.apache.hadoo...
>   TestRMContainerAllocator.testMapReduceAllocationWithNodeLabelExpression:722 » ClassCast
>   TestRMContainerAllocator.testReducerRampdownDiagnostics:443 » ClassCast org.ap...
>   TestRMContainerAllocator.testReportedAppProgressWithOnlyMaps:1118 » NullPointer
>   TestRMContainerAllocator.testMapReduceScheduling:819 » ClassCast org.apache.ha...
>   TestRMContainerAllocator.testResource:390 » ClassCast org.apache.hadoop.mapred...
>   TestRMContainerAllocator.testUpdatedNodes:1190 » ClassCast org.apache.hadoop.m...
>   TestRMContainerAllocator.testCompletedTasksRecalculateSchedule:2249 » ClassCast
>   TestRMContainerAllocator.testConcurrentTaskLimits:2779 » ClassCast org.apache....
>   TestRMContainerAllocator.testSimple:219 » ClassCast org.apache.hadoop.mapreduc...
>   TestRMContainerAllocator.testIgnoreBlacklisting:1378->getContainerOnHost:1511 »
ClassCast
>   TestRMContainerAllocator.testMapNodeLocality:310 » ClassCast org.apache.hadoop...
>   TestRMContainerAllocator.testRMContainerAllocatorResendsRequestsOnRMRestart:2489 »
ClassCast
> Tests run: 26, Failures: 0, Errors: 17, Skipped: 0
> {noformat}



--
This message was sent by Atlassian JIRA
(v6.3.4#6332)

Mime
View raw message