hadoop-yarn-issues mailing list archives

Site index · List index
Message view « Date » · « Thread »
Top « Date » · « Thread »
From "Steve Loughran (JIRA)" <j...@apache.org>
Subject [jira] [Commented] (YARN-4155) TestLogAggregationService.testLogAggregationServiceWithInterval failing
Date Sat, 19 Sep 2015 14:00:08 GMT

    [ https://issues.apache.org/jira/browse/YARN-4155?page=com.atlassian.jira.plugin.system.issuetabpanels:comment-tabpanel&focusedCommentId=14877131#comment-14877131
] 

Steve Loughran commented on YARN-4155:
--------------------------------------

failed on local test run
{code}
-------------------------------------------------------
 T E S T S
-------------------------------------------------------
Running org.apache.hadoop.yarn.server.nodemanager.containermanager.logaggregation.TestLogAggregationService
Tests run: 34, Failures: 1, Errors: 0, Skipped: 0, Time elapsed: 109.991 sec <<<
FAILURE! - in org.apache.hadoop.yarn.server.nodemanager.containermanager.logaggregation.TestLogAggregationService
testLocalFileDeletionOnDiskFull(org.apache.hadoop.yarn.server.nodemanager.containermanager.logaggregation.TestLogAggregationService)
 Time elapsed: 0.176 sec  <<< FAILURE!
java.lang.AssertionError: Log file [/Users/stevel/Hadoop/commit/apache-hadoop/hadoop-yarn-project/hadoop-yarn/hadoop-yarn-server/hadoop-yarn-server-nodemanager/target/org.apache.hadoop.yarn.server.nodemanager.containermanager.logaggregation.TestLogAggregationService-remoteLogDir/nobody/logs/application_1234_0001/0.0.0.0_5555]
not found
	at org.junit.Assert.fail(Assert.java:88)
	at org.junit.Assert.assertTrue(Assert.java:41)
	at org.apache.hadoop.yarn.server.nodemanager.containermanager.logaggregation.TestLogAggregationService.verifyLocalFileDeletion(TestLogAggregationService.java:235)
	at org.apache.hadoop.yarn.server.nodemanager.containermanager.logaggregation.TestLogAggregationService.testLocalFileDeletionOnDiskFull(TestLogAggregationService.java:285)


Results :

Failed tests: 
  TestLogAggregationService.testLocalFileDeletionOnDiskFull:285->verifyLocalFileDeletion:235
Log file [/Users/stevel/Hadoop/commit/apache-hadoop/hadoop-yarn-project/hadoop-yarn/hadoop-yarn-server/hadoop-yarn-server-nodemanager/target/org.apache.hadoop.yarn.server.nodemanager.containermanager.logaggregation.TestLogAggregationService-remoteLogDir/nobody/logs/application_1234_0001/0.0.0.0_5555]
not found

Tests run: 34, Failures: 1, Errors: 0, Skipped: 0
{code}

> TestLogAggregationService.testLogAggregationServiceWithInterval failing
> -----------------------------------------------------------------------
>
>                 Key: YARN-4155
>                 URL: https://issues.apache.org/jira/browse/YARN-4155
>             Project: Hadoop YARN
>          Issue Type: Bug
>          Components: test
>    Affects Versions: 3.0.0
>         Environment: Jenkins
>            Reporter: Steve Loughran
>            Assignee: Bibin A Chundatt
>            Priority: Critical
>         Attachments: 0001-YARN-4155.patch, 0001-YARN-4155.patch
>
>
> Test failing on Jenkins: {{TestLogAggregationService.testLogAggregationServiceWithInterval}}



--
This message was sent by Atlassian JIRA
(v6.3.4#6332)

Mime
View raw message