hadoop-yarn-issues mailing list archives

Site index · List index
Message view « Date » · « Thread »
Top « Date » · « Thread »
From "Hadoop QA (JIRA)" <j...@apache.org>
Subject [jira] [Commented] (YARN-3954) TestYarnConfigurationFields#testCompareConfigurationClassAgainstXml fails in trunk
Date Wed, 22 Jul 2015 15:55:04 GMT

    [ https://issues.apache.org/jira/browse/YARN-3954?page=com.atlassian.jira.plugin.system.issuetabpanels:comment-tabpanel&focusedCommentId=14637110#comment-14637110
] 

Hadoop QA commented on YARN-3954:
---------------------------------

\\
\\
| (x) *{color:red}-1 overall{color}* |
\\
\\
|| Vote || Subsystem || Runtime || Comment ||
| {color:blue}0{color} | pre-patch |  16m 34s | Pre-patch trunk compilation is healthy. |
| {color:green}+1{color} | @author |   0m  0s | The patch does not contain any @author tags.
|
| {color:red}-1{color} | tests included |   0m  0s | The patch doesn't appear to include any
new or modified tests.  Please justify why no new tests are needed for this patch. Also please
list what manual steps were performed to verify this patch. |
| {color:green}+1{color} | javac |   8m 31s | There were no new javac warning messages. |
| {color:green}+1{color} | javadoc |  10m 30s | There were no new javadoc warning messages.
|
| {color:green}+1{color} | release audit |   0m 21s | The applied patch does not increase
the total number of release audit warnings. |
| {color:red}-1{color} | whitespace |   0m  0s | The patch has 1  line(s) that end in whitespace.
Use git apply --whitespace=fix. |
| {color:green}+1{color} | install |   1m 28s | mvn install still works. |
| {color:green}+1{color} | eclipse:eclipse |   0m 36s | The patch built with eclipse:eclipse.
|
| {color:green}+1{color} | yarn tests |   2m  0s | Tests passed in hadoop-yarn-common. |
| | |  40m  3s | |
\\
\\
|| Subsystem || Report/Notes ||
| Patch URL | http://issues.apache.org/jira/secure/attachment/12746540/YARN-3954.01.patch
|
| Optional Tests | javadoc javac unit |
| git revision | trunk / 4025326 |
| whitespace | https://builds.apache.org/job/PreCommit-YARN-Build/8611/artifact/patchprocess/whitespace.txt
|
| hadoop-yarn-common test log | https://builds.apache.org/job/PreCommit-YARN-Build/8611/artifact/patchprocess/testrun_hadoop-yarn-common.txt
|
| Test Results | https://builds.apache.org/job/PreCommit-YARN-Build/8611/testReport/ |
| Java | 1.7.0_55 |
| uname | Linux asf907.gq1.ygridcore.net 3.13.0-36-lowlatency #63-Ubuntu SMP PREEMPT Wed Sep
3 21:56:12 UTC 2014 x86_64 x86_64 x86_64 GNU/Linux |
| Console output | https://builds.apache.org/job/PreCommit-YARN-Build/8611/console |


This message was automatically generated.

> TestYarnConfigurationFields#testCompareConfigurationClassAgainstXml fails in trunk
> ----------------------------------------------------------------------------------
>
>                 Key: YARN-3954
>                 URL: https://issues.apache.org/jira/browse/YARN-3954
>             Project: Hadoop YARN
>          Issue Type: Bug
>            Reporter: Varun Saxena
>            Assignee: Varun Saxena
>         Attachments: YARN-3954.01.patch
>
>
> {noformat}
> Running org.apache.hadoop.yarn.conf.TestYarnConfigurationFields
> Tests run: 2, Failures: 1, Errors: 0, Skipped: 0, Time elapsed: 0.47 sec <<<
FAILURE! - in org.apache.hadoop.yarn.conf.TestYarnConfigurationFields
> testCompareConfigurationClassAgainstXml(org.apache.hadoop.yarn.conf.TestYarnConfigurationFields)
 Time elapsed: 0.068 sec  <<< FAILURE!
> java.lang.AssertionError: class org.apache.hadoop.yarn.conf.YarnConfiguration has 1 variables
missing in yarn-default.xml
> 	at org.junit.Assert.fail(Assert.java:88)
> 	at org.junit.Assert.assertTrue(Assert.java:41)
> 	at org.apache.hadoop.conf.TestConfigurationFieldsBase.testCompareConfigurationClassAgainstXml(TestConfigurationFieldsBase.java:429)
> 	at sun.reflect.NativeMethodAccessorImpl.invoke0(Native Method)
> 	at sun.reflect.NativeMethodAccessorImpl.invoke(NativeMethodAccessorImpl.java:57)
> 	at sun.reflect.DelegatingMethodAccessorImpl.invoke(DelegatingMethodAccessorImpl.java:43)
> 	at java.lang.reflect.Method.invoke(Method.java:606)
> 	at org.junit.runners.model.FrameworkMethod$1.runReflectiveCall(FrameworkMethod.java:47)
> 	at org.junit.internal.runners.model.ReflectiveCallable.run(ReflectiveCallable.java:12)
> 	at org.junit.runners.model.FrameworkMethod.invokeExplosively(FrameworkMethod.java:44)
> 	at org.junit.internal.runners.statements.InvokeMethod.evaluate(InvokeMethod.java:17)
> 	at org.junit.internal.runners.statements.RunBefores.evaluate(RunBefores.java:26)
> 	at org.junit.runners.ParentRunner.runLeaf(ParentRunner.java:271)
> 	at org.junit.runners.BlockJUnit4ClassRunner.runChild(BlockJUnit4ClassRunner.java:70)
> 	at org.junit.runners.BlockJUnit4ClassRunner.runChild(BlockJUnit4ClassRunner.java:50)
> 	at org.junit.runners.ParentRunner$3.run(ParentRunner.java:238)
> 	at org.junit.runners.ParentRunner$1.schedule(ParentRunner.java:63)
> 	at org.junit.runners.ParentRunner.runChildren(ParentRunner.java:236)
> 	at org.junit.runners.ParentRunner.access$000(ParentRunner.java:53)
> 	at org.junit.runners.ParentRunner$2.evaluate(ParentRunner.java:229)
> 	at org.junit.runners.ParentRunner.run(ParentRunner.java:309)
> 	at org.apache.maven.surefire.junit4.JUnit4Provider.execute(JUnit4Provider.java:264)
> 	at org.apache.maven.surefire.junit4.JUnit4Provider.executeTestSet(JUnit4Provider.java:153)
> 	at org.apache.maven.surefire.junit4.JUnit4Provider.invoke(JUnit4Provider.java:124)
> 	at org.apache.maven.surefire.booter.ForkedBooter.invokeProviderInSameClassLoader(ForkedBooter.java:200)
> 	at org.apache.maven.surefire.booter.ForkedBooter.runSuitesInProcess(ForkedBooter.java:153)
> 	at org.apache.maven.surefire.booter.ForkedBooter.main(ForkedBooter.java:103)
> {noformat}



--
This message was sent by Atlassian JIRA
(v6.3.4#6332)

Mime
View raw message