hadoop-yarn-issues mailing list archives

Site index · List index
Message view « Date » · « Thread »
Top « Date » · « Thread »
From "Anubhav Dhoot (JIRA)" <j...@apache.org>
Subject [jira] [Commented] (YARN-3910) TestRMAppTransitions#testAppAcceptedAttemptKilled fails on trunk
Date Sat, 11 Jul 2015 23:03:04 GMT

    [ https://issues.apache.org/jira/browse/YARN-3910?page=com.atlassian.jira.plugin.system.issuetabpanels:comment-tabpanel&focusedCommentId=14623617#comment-14623617
] 

Anubhav Dhoot commented on YARN-3910:
-------------------------------------

LGTM. Tried out the changes and even if I force slow down the scheduler dispatcher thread
to simulate a slow machine it still passes.

> TestRMAppTransitions#testAppAcceptedAttemptKilled fails on trunk
> ----------------------------------------------------------------
>
>                 Key: YARN-3910
>                 URL: https://issues.apache.org/jira/browse/YARN-3910
>             Project: Hadoop YARN
>          Issue Type: Bug
>    Affects Versions: 2.7.0
>            Reporter: Varun Saxena
>            Assignee: Varun Saxena
>         Attachments: YARN-3910.001.patch, YARN-3910.02.patch
>
>
> Check https://builds.apache.org/job/PreCommit-YARN-Build/8493/testReport/
> {noformat}
> Running org.apache.hadoop.yarn.server.resourcemanager.rmapp.TestRMAppTransitions
> Tests run: 44, Failures: 2, Errors: 0, Skipped: 0, Time elapsed: 3.515 sec <<<
FAILURE! - in org.apache.hadoop.yarn.server.resourcemanager.rmapp.TestRMAppTransitions
> testAppAcceptedAttemptKilled[0](org.apache.hadoop.yarn.server.resourcemanager.rmapp.TestRMAppTransitions)
 Time elapsed: 0.049 sec  <<< FAILURE!
> java.lang.AssertionError: expected:<APP_REMOVED> but was:<APP_ATTEMPT_ADDED>
> 	at org.junit.Assert.fail(Assert.java:88)
> 	at org.junit.Assert.failNotEquals(Assert.java:743)
> 	at org.junit.Assert.assertEquals(Assert.java:118)
> 	at org.junit.Assert.assertEquals(Assert.java:144)
> 	at org.apache.hadoop.yarn.server.resourcemanager.rmapp.TestRMAppTransitions.verifyAppRemovedSchedulerEvent(TestRMAppTransitions.java:1032)
> 	at org.apache.hadoop.yarn.server.resourcemanager.rmapp.TestRMAppTransitions.testAppAcceptedAttemptKilled(TestRMAppTransitions.java:742)
> testAppAcceptedAttemptKilled[1](org.apache.hadoop.yarn.server.resourcemanager.rmapp.TestRMAppTransitions)
 Time elapsed: 0.031 sec  <<< FAILURE!
> java.lang.AssertionError: expected:<APP_REMOVED> but was:<APP_ATTEMPT_ADDED>
> 	at org.junit.Assert.fail(Assert.java:88)
> 	at org.junit.Assert.failNotEquals(Assert.java:743)
> 	at org.junit.Assert.assertEquals(Assert.java:118)
> 	at org.junit.Assert.assertEquals(Assert.java:144)
> 	at org.apache.hadoop.yarn.server.resourcemanager.rmapp.TestRMAppTransitions.verifyAppRemovedSchedulerEvent(TestRMAppTransitions.java:1032)
> 	at org.apache.hadoop.yarn.server.resourcemanager.rmapp.TestRMAppTransitions.testAppAcceptedAttemptKilled(TestRMAppTransitions.java:742)
> {noformat}



--
This message was sent by Atlassian JIRA
(v6.3.4#6332)

Mime
View raw message