hadoop-yarn-issues mailing list archives

Site index · List index
Message view « Date » · « Thread »
Top « Date » · « Thread »
From "Varun Saxena (JIRA)" <j...@apache.org>
Subject [jira] [Updated] (YARN-3910) TestRMAppTransitions#testAppAcceptedAttemptKilled fails on trunk
Date Fri, 10 Jul 2015 19:09:04 GMT

     [ https://issues.apache.org/jira/browse/YARN-3910?page=com.atlassian.jira.plugin.system.issuetabpanels:all-tabpanel
]

Varun Saxena updated YARN-3910:
-------------------------------
    Attachment:     (was: YARN-3910.01.patch)

> TestRMAppTransitions#testAppAcceptedAttemptKilled fails on trunk
> ----------------------------------------------------------------
>
>                 Key: YARN-3910
>                 URL: https://issues.apache.org/jira/browse/YARN-3910
>             Project: Hadoop YARN
>          Issue Type: Bug
>            Reporter: Varun Saxena
>            Assignee: Varun Saxena
>
> Check https://builds.apache.org/job/PreCommit-YARN-Build/8493/testReport/
> {noformat}
> Running org.apache.hadoop.yarn.server.resourcemanager.rmapp.TestRMAppTransitions
> Tests run: 44, Failures: 2, Errors: 0, Skipped: 0, Time elapsed: 3.515 sec <<<
FAILURE! - in org.apache.hadoop.yarn.server.resourcemanager.rmapp.TestRMAppTransitions
> testAppAcceptedAttemptKilled[0](org.apache.hadoop.yarn.server.resourcemanager.rmapp.TestRMAppTransitions)
 Time elapsed: 0.049 sec  <<< FAILURE!
> java.lang.AssertionError: expected:<APP_REMOVED> but was:<APP_ATTEMPT_ADDED>
> 	at org.junit.Assert.fail(Assert.java:88)
> 	at org.junit.Assert.failNotEquals(Assert.java:743)
> 	at org.junit.Assert.assertEquals(Assert.java:118)
> 	at org.junit.Assert.assertEquals(Assert.java:144)
> 	at org.apache.hadoop.yarn.server.resourcemanager.rmapp.TestRMAppTransitions.verifyAppRemovedSchedulerEvent(TestRMAppTransitions.java:1032)
> 	at org.apache.hadoop.yarn.server.resourcemanager.rmapp.TestRMAppTransitions.testAppAcceptedAttemptKilled(TestRMAppTransitions.java:742)
> testAppAcceptedAttemptKilled[1](org.apache.hadoop.yarn.server.resourcemanager.rmapp.TestRMAppTransitions)
 Time elapsed: 0.031 sec  <<< FAILURE!
> java.lang.AssertionError: expected:<APP_REMOVED> but was:<APP_ATTEMPT_ADDED>
> 	at org.junit.Assert.fail(Assert.java:88)
> 	at org.junit.Assert.failNotEquals(Assert.java:743)
> 	at org.junit.Assert.assertEquals(Assert.java:118)
> 	at org.junit.Assert.assertEquals(Assert.java:144)
> 	at org.apache.hadoop.yarn.server.resourcemanager.rmapp.TestRMAppTransitions.verifyAppRemovedSchedulerEvent(TestRMAppTransitions.java:1032)
> 	at org.apache.hadoop.yarn.server.resourcemanager.rmapp.TestRMAppTransitions.testAppAcceptedAttemptKilled(TestRMAppTransitions.java:742)
> {noformat}



--
This message was sent by Atlassian JIRA
(v6.3.4#6332)

Mime
View raw message