hadoop-yarn-issues mailing list archives

Site index · List index
Message view « Date » · « Thread »
Top « Date » · « Thread »
From "Varun Saxena (JIRA)" <j...@apache.org>
Subject [jira] [Resolved] (YARN-3909) TestAMRMRPCNodeUpdates#testAMRMUnusableNodes fails on trunk
Date Wed, 15 Jul 2015 11:41:04 GMT

     [ https://issues.apache.org/jira/browse/YARN-3909?page=com.atlassian.jira.plugin.system.issuetabpanels:all-tabpanel
]

Varun Saxena resolved YARN-3909.
--------------------------------
    Resolution: Duplicate

> TestAMRMRPCNodeUpdates#testAMRMUnusableNodes fails on trunk
> -----------------------------------------------------------
>
>                 Key: YARN-3909
>                 URL: https://issues.apache.org/jira/browse/YARN-3909
>             Project: Hadoop YARN
>          Issue Type: Bug
>    Affects Versions: 2.7.0
>            Reporter: Varun Saxena
>            Assignee: Varun Saxena
>
> {noformat}
> Running org.apache.hadoop.yarn.server.resourcemanager.applicationsmanager.TestAMRMRPCNodeUpdates
> Tests run: 1, Failures: 1, Errors: 0, Skipped: 0, Time elapsed: 5.413 sec <<<
FAILURE! - in org.apache.hadoop.yarn.server.resourcemanager.applicationsmanager.TestAMRMRPCNodeUpdates
> testAMRMUnusableNodes(org.apache.hadoop.yarn.server.resourcemanager.applicationsmanager.TestAMRMRPCNodeUpdates)
 Time elapsed: 5.327 sec  <<< FAILURE!
> java.lang.AssertionError: expected:<1> but was:<0>
> 	at org.junit.Assert.fail(Assert.java:88)
> 	at org.junit.Assert.failNotEquals(Assert.java:743)
> 	at org.junit.Assert.assertEquals(Assert.java:118)
> 	at org.junit.Assert.assertEquals(Assert.java:555)
> 	at org.junit.Assert.assertEquals(Assert.java:542)
> 	at org.apache.hadoop.yarn.server.resourcemanager.applicationsmanager.TestAMRMRPCNodeUpdates.testAMRMUnusableNodes(TestAMRMRPCNodeUpdates.java:156)
> {noformat}



--
This message was sent by Atlassian JIRA
(v6.3.4#6332)

Mime
View raw message