hadoop-yarn-issues mailing list archives

Site index · List index
Message view « Date » · « Thread »
Top « Date » · « Thread »
From "Hudson (JIRA)" <j...@apache.org>
Subject [jira] [Commented] (YARN-3459) Fix failiure of TestLog4jWarningErrorMetricsAppender
Date Thu, 09 Apr 2015 10:42:16 GMT

    [ https://issues.apache.org/jira/browse/YARN-3459?page=com.atlassian.jira.plugin.system.issuetabpanels:comment-tabpanel&focusedCommentId=14487121#comment-14487121
] 

Hudson commented on YARN-3459:
------------------------------

FAILURE: Integrated in Hadoop-Yarn-trunk-Java8 #158 (See [https://builds.apache.org/job/Hadoop-Yarn-trunk-Java8/158/])
YARN-3459. Fix failiure of TestLog4jWarningErrorMetricsAppender. (Varun Vasudev via wangda)
(wangda: rev 7af086a515d573dc90ea4deec7f4e3f23622e0e8)
* hadoop-yarn-project/hadoop-yarn/hadoop-yarn-common/src/test/java/org/apache/hadoop/yarn/util/TestLog4jWarningErrorMetricsAppender.java
* hadoop-yarn-project/CHANGES.txt


> Fix failiure of TestLog4jWarningErrorMetricsAppender
> ----------------------------------------------------
>
>                 Key: YARN-3459
>                 URL: https://issues.apache.org/jira/browse/YARN-3459
>             Project: Hadoop YARN
>          Issue Type: Bug
>            Reporter: Li Lu
>            Assignee: Varun Vasudev
>            Priority: Blocker
>             Fix For: 2.8.0
>
>         Attachments: apache-yarn-3459.0.patch
>
>
> TestLog4jWarningErrorMetricsAppender fails with the following message:
> {code}
> Running org.apache.hadoop.yarn.util.TestLog4jWarningErrorMetricsAppender
> Tests run: 6, Failures: 1, Errors: 0, Skipped: 0, Time elapsed: 6.214 sec <<<
FAILURE! - in org.apache.hadoop.yarn.util.TestLog4jWarningErrorMetricsAppender
> testPurge(org.apache.hadoop.yarn.util.TestLog4jWarningErrorMetricsAppender)  Time elapsed:
2.01 sec  <<< FAILURE!
> java.lang.AssertionError: expected:<0> but was:<1>
> 	at org.junit.Assert.fail(Assert.java:88)
> 	at org.junit.Assert.failNotEquals(Assert.java:743)
> 	at org.junit.Assert.assertEquals(Assert.java:118)
> 	at org.junit.Assert.assertEquals(Assert.java:555)
> 	at org.junit.Assert.assertEquals(Assert.java:542)
> 	at org.apache.hadoop.yarn.util.TestLog4jWarningErrorMetricsAppender.testPurge(TestLog4jWarningErrorMetricsAppender.java:89)
> {code}



--
This message was sent by Atlassian JIRA
(v6.3.4#6332)

Mime
View raw message