hadoop-yarn-issues mailing list archives

Site index · List index
Message view « Date » · « Thread »
Top « Date » · « Thread »
From "Hadoop QA (JIRA)" <j...@apache.org>
Subject [jira] [Commented] (YARN-3459) TestLog4jWarningErrorMetricsAppender breaks in trunk
Date Wed, 08 Apr 2015 06:18:13 GMT

    [ https://issues.apache.org/jira/browse/YARN-3459?page=com.atlassian.jira.plugin.system.issuetabpanels:comment-tabpanel&focusedCommentId=14484798#comment-14484798
] 

Hadoop QA commented on YARN-3459:
---------------------------------

{color:red}-1 overall{color}.  Here are the results of testing the latest attachment 
  http://issues.apache.org/jira/secure/attachment/12723835/apache-yarn-3459.0.patch
  against trunk revision ab04ff9.

    {color:green}+1 @author{color}.  The patch does not contain any @author tags.

    {color:green}+1 tests included{color}.  The patch appears to include 1 new or modified
test files.

    {color:green}+1 javac{color}.  The applied patch does not increase the total number of
javac compiler warnings.

    {color:green}+1 javadoc{color}.  There were no new javadoc warning messages.

    {color:green}+1 eclipse:eclipse{color}.  The patch built with eclipse:eclipse.

    {color:red}-1 findbugs{color}.  The patch appears to introduce 2 new Findbugs (version
2.0.3) warnings.

    {color:green}+1 release audit{color}.  The applied patch does not increase the total number
of release audit warnings.

    {color:green}+1 core tests{color}.  The patch passed unit tests in hadoop-yarn-project/hadoop-yarn/hadoop-yarn-common.

Test results: https://builds.apache.org/job/PreCommit-YARN-Build/7251//testReport/
Findbugs warnings: https://builds.apache.org/job/PreCommit-YARN-Build/7251//artifact/patchprocess/newPatchFindbugsWarningshadoop-yarn-common.html
Console output: https://builds.apache.org/job/PreCommit-YARN-Build/7251//console

This message is automatically generated.

> TestLog4jWarningErrorMetricsAppender breaks in trunk
> ----------------------------------------------------
>
>                 Key: YARN-3459
>                 URL: https://issues.apache.org/jira/browse/YARN-3459
>             Project: Hadoop YARN
>          Issue Type: Bug
>            Reporter: Li Lu
>            Assignee: Li Lu
>            Priority: Blocker
>             Fix For: 2.7.0
>
>         Attachments: apache-yarn-3459.0.patch
>
>
> TestLog4jWarningErrorMetricsAppender fails with the following message:
> {code}
> Running org.apache.hadoop.yarn.util.TestLog4jWarningErrorMetricsAppender
> Tests run: 6, Failures: 1, Errors: 0, Skipped: 0, Time elapsed: 6.214 sec <<<
FAILURE! - in org.apache.hadoop.yarn.util.TestLog4jWarningErrorMetricsAppender
> testPurge(org.apache.hadoop.yarn.util.TestLog4jWarningErrorMetricsAppender)  Time elapsed:
2.01 sec  <<< FAILURE!
> java.lang.AssertionError: expected:<0> but was:<1>
> 	at org.junit.Assert.fail(Assert.java:88)
> 	at org.junit.Assert.failNotEquals(Assert.java:743)
> 	at org.junit.Assert.assertEquals(Assert.java:118)
> 	at org.junit.Assert.assertEquals(Assert.java:555)
> 	at org.junit.Assert.assertEquals(Assert.java:542)
> 	at org.apache.hadoop.yarn.util.TestLog4jWarningErrorMetricsAppender.testPurge(TestLog4jWarningErrorMetricsAppender.java:89)
> {code}



--
This message was sent by Atlassian JIRA
(v6.3.4#6332)

Mime
View raw message