hadoop-yarn-issues mailing list archives

Site index · List index
Message view « Date » · « Thread »
Top « Date » · « Thread »
From "zhihai xu (JIRA)" <j...@apache.org>
Subject [jira] [Updated] (YARN-2666) TestFairScheduler.testContinuousScheduling fails Intermittently
Date Thu, 02 Apr 2015 21:59:53 GMT

     [ https://issues.apache.org/jira/browse/YARN-2666?page=com.atlassian.jira.plugin.system.issuetabpanels:all-tabpanel
]

zhihai xu updated YARN-2666:
----------------------------
    Attachment: YARN-2666.000.patch

> TestFairScheduler.testContinuousScheduling fails Intermittently
> ---------------------------------------------------------------
>
>                 Key: YARN-2666
>                 URL: https://issues.apache.org/jira/browse/YARN-2666
>             Project: Hadoop YARN
>          Issue Type: Test
>          Components: scheduler
>            Reporter: Tsuyoshi Ozawa
>            Assignee: zhihai xu
>         Attachments: YARN-2666.000.patch
>
>
> The test fails on trunk.
> {code}
> Tests run: 79, Failures: 1, Errors: 0, Skipped: 0, Time elapsed: 8.698 sec <<<
FAILURE! - in org.apache.hadoop.yarn.server.resourcemanager.scheduler.fair.TestFairScheduler
> testContinuousScheduling(org.apache.hadoop.yarn.server.resourcemanager.scheduler.fair.TestFairScheduler)
 Time elapsed: 0.582 sec  <<< FAILURE!
> java.lang.AssertionError: expected:<2> but was:<1>
> 	at org.junit.Assert.fail(Assert.java:88)
> 	at org.junit.Assert.failNotEquals(Assert.java:743)
> 	at org.junit.Assert.assertEquals(Assert.java:118)
> 	at org.junit.Assert.assertEquals(Assert.java:555)
> 	at org.junit.Assert.assertEquals(Assert.java:542)
> 	at org.apache.hadoop.yarn.server.resourcemanager.scheduler.fair.TestFairScheduler.testContinuousScheduling(TestFairScheduler.java:3372)
> {code}



--
This message was sent by Atlassian JIRA
(v6.3.4#6332)

Mime
View raw message