hadoop-yarn-issues mailing list archives

Site index · List index
Message view « Date » · « Thread »
Top « Date » · « Thread »
From "Hadoop QA (JIRA)" <j...@apache.org>
Subject [jira] [Commented] (YARN-2666) TestFairScheduler.testContinuousScheduling fails Intermittently
Date Tue, 31 Mar 2015 12:29:53 GMT

    [ https://issues.apache.org/jira/browse/YARN-2666?page=com.atlassian.jira.plugin.system.issuetabpanels:comment-tabpanel&focusedCommentId=14388454#comment-14388454
] 

Hadoop QA commented on YARN-2666:
---------------------------------

{color:red}-1 overall{color}.  Here are the results of testing the latest attachment 
  http://issues.apache.org/jira/secure/attachment/12708403/YARN-2666.000.patch
  against trunk revision b5a22e9.

    {color:green}+1 @author{color}.  The patch does not contain any @author tags.

    {color:green}+1 tests included{color}.  The patch appears to include 1 new or modified
test files.

    {color:green}+1 javac{color}.  The applied patch does not increase the total number of
javac compiler warnings.

    {color:green}+1 javadoc{color}.  There were no new javadoc warning messages.

    {color:green}+1 eclipse:eclipse{color}.  The patch built with eclipse:eclipse.

    {color:green}+1 findbugs{color}.  The patch does not introduce any new Findbugs (version
2.0.3) warnings.

    {color:green}+1 release audit{color}.  The applied patch does not increase the total number
of release audit warnings.

    {color:red}-1 core tests{color}.  The patch failed these unit tests in hadoop-yarn-project/hadoop-yarn/hadoop-yarn-server/hadoop-yarn-server-resourcemanager:

                  org.apache.hadoop.yarn.server.resourcemanager.security.TestAMRMTokens

Test results: https://builds.apache.org/job/PreCommit-YARN-Build/7172//testReport/
Console output: https://builds.apache.org/job/PreCommit-YARN-Build/7172//console

This message is automatically generated.

> TestFairScheduler.testContinuousScheduling fails Intermittently
> ---------------------------------------------------------------
>
>                 Key: YARN-2666
>                 URL: https://issues.apache.org/jira/browse/YARN-2666
>             Project: Hadoop YARN
>          Issue Type: Test
>          Components: scheduler
>            Reporter: Tsuyoshi Ozawa
>            Assignee: Wei Yan
>         Attachments: YARN-2666.000.patch
>
>
> The test fails on trunk.
> {code}
> Tests run: 79, Failures: 1, Errors: 0, Skipped: 0, Time elapsed: 8.698 sec <<<
FAILURE! - in org.apache.hadoop.yarn.server.resourcemanager.scheduler.fair.TestFairScheduler
> testContinuousScheduling(org.apache.hadoop.yarn.server.resourcemanager.scheduler.fair.TestFairScheduler)
 Time elapsed: 0.582 sec  <<< FAILURE!
> java.lang.AssertionError: expected:<2> but was:<1>
> 	at org.junit.Assert.fail(Assert.java:88)
> 	at org.junit.Assert.failNotEquals(Assert.java:743)
> 	at org.junit.Assert.assertEquals(Assert.java:118)
> 	at org.junit.Assert.assertEquals(Assert.java:555)
> 	at org.junit.Assert.assertEquals(Assert.java:542)
> 	at org.apache.hadoop.yarn.server.resourcemanager.scheduler.fair.TestFairScheduler.testContinuousScheduling(TestFairScheduler.java:3372)
> {code}



--
This message was sent by Atlassian JIRA
(v6.3.4#6332)

Mime
View raw message