hadoop-yarn-issues mailing list archives

Site index · List index
Message view « Date » · « Thread »
Top « Date » · « Thread »
From "Hadoop QA (JIRA)" <j...@apache.org>
Subject [jira] [Commented] (YARN-2785) TestContainerResourceUsage fails intermittently
Date Fri, 31 Oct 2014 10:27:34 GMT

    [ https://issues.apache.org/jira/browse/YARN-2785?page=com.atlassian.jira.plugin.system.issuetabpanels:comment-tabpanel&focusedCommentId=14191664#comment-14191664
] 

Hadoop QA commented on YARN-2785:
---------------------------------

{color:green}+1 overall{color}.  Here are the results of testing the latest attachment 
  http://issues.apache.org/jira/secure/attachment/12678445/apache-yarn-2785.0.patch
  against trunk revision d1828d9.

    {color:green}+1 @author{color}.  The patch does not contain any @author tags.

    {color:green}+1 tests included{color}.  The patch appears to include 1 new or modified
test files.

    {color:green}+1 javac{color}.  The applied patch does not increase the total number of
javac compiler warnings.

    {color:green}+1 javadoc{color}.  There were no new javadoc warning messages.

    {color:green}+1 eclipse:eclipse{color}.  The patch built with eclipse:eclipse.

    {color:green}+1 findbugs{color}.  The patch does not introduce any new Findbugs (version
2.0.3) warnings.

    {color:green}+1 release audit{color}.  The applied patch does not increase the total number
of release audit warnings.

    {color:green}+1 core tests{color}.  The patch passed unit tests in hadoop-yarn-project/hadoop-yarn/hadoop-yarn-server/hadoop-yarn-server-resourcemanager.

    {color:green}+1 contrib tests{color}.  The patch passed contrib unit tests.

Test results: https://builds.apache.org/job/PreCommit-YARN-Build/5654//testReport/
Console output: https://builds.apache.org/job/PreCommit-YARN-Build/5654//console

This message is automatically generated.

> TestContainerResourceUsage fails intermittently
> -----------------------------------------------
>
>                 Key: YARN-2785
>                 URL: https://issues.apache.org/jira/browse/YARN-2785
>             Project: Hadoop YARN
>          Issue Type: Test
>            Reporter: Varun Vasudev
>            Assignee: Varun Vasudev
>         Attachments: apache-yarn-2785.0.patch
>
>
> TestContainerResourceUsage fails sometimes due to the timeout values being low.
> From the test failures - 
> {noformat}
> ------------------------------------------------------
> Running org.apache.hadoop.yarn.server.resourcemanager.TestContainerResourceUsage
> Tests run: 4, Failures: 1, Errors: 1, Skipped: 0, Time elapsed: 71.264 sec <<<
FAILURE! - in org.apache.hadoop.yarn.server.resourcemanager.TestContainerResource
> testUsageWithMultipleContainersAndRMRestart(org.apache.hadoop.yarn.server.resourcemanager.TestContainerResourceUsage)
 Time elapsed: 60.032 sec  <<< ERROR!
> java.lang.Exception: test timed out after 60000 milliseconds
>         at java.lang.Thread.sleep(Native Method)
>         at org.apache.hadoop.yarn.server.resourcemanager.MockRM.waitForState(MockRM.java:209)
>         at org.apache.hadoop.yarn.server.resourcemanager.MockRM.waitForState(MockRM.java:198)
>         at org.apache.hadoop.yarn.server.resourcemanager.TestContainerResourceUsage.testUsageWithMultipleContainersAndRMRestart(TestContainerResourceUsage.java:
> testUsageWithOneAttemptAndOneContainer(org.apache.hadoop.yarn.server.resourcemanager.TestContainerResourceUsage)
 Time elapsed: 3.375 sec  <<< FAILURE!
> java.lang.AssertionError: While app is running, memory seconds should be >0 but is
0
>         at org.junit.Assert.fail(Assert.java:88)
>         at org.junit.Assert.assertTrue(Assert.java:41)
>         at org.apache.hadoop.yarn.server.resourcemanager.TestContainerResourceUsage.testUsageWithOneAttemptAndOneContainer(TestContainerResourceUsage.java:108)
> {noformat}



--
This message was sent by Atlassian JIRA
(v6.3.4#6332)

Mime
View raw message