hadoop-yarn-issues mailing list archives

Site index · List index
Message view « Date » · « Thread »
Top « Date » · « Thread »
From "Hudson (JIRA)" <j...@apache.org>
Subject [jira] [Commented] (YARN-2769) Timeline server domain not set correctly when using shell_command on Windows
Date Thu, 30 Oct 2014 15:17:36 GMT

    [ https://issues.apache.org/jira/browse/YARN-2769?page=com.atlassian.jira.plugin.system.issuetabpanels:comment-tabpanel&focusedCommentId=14190200#comment-14190200
] 

Hudson commented on YARN-2769:
------------------------------

FAILURE: Integrated in Hadoop-Mapreduce-trunk #1942 (See [https://builds.apache.org/job/Hadoop-Mapreduce-trunk/1942/])
YARN-2769. Fixed the problem that timeline domain is not set in distributed shell AM when
using shell_command on Windows. Contributed by Varun Vasudev. (zjshen: rev a8c120222047280234c3411ce1c1c9b17f08c851)
* hadoop-yarn-project/CHANGES.txt
* hadoop-yarn-project/hadoop-yarn/hadoop-yarn-applications/hadoop-yarn-applications-distributedshell/src/main/java/org/apache/hadoop/yarn/applications/distributedshell/ApplicationMaster.java


> Timeline server domain not set correctly when using shell_command on Windows
> ----------------------------------------------------------------------------
>
>                 Key: YARN-2769
>                 URL: https://issues.apache.org/jira/browse/YARN-2769
>             Project: Hadoop YARN
>          Issue Type: Bug
>          Components: applications/distributed-shell
>            Reporter: Varun Vasudev
>            Assignee: Varun Vasudev
>             Fix For: 2.6.0
>
>         Attachments: apache-yarn-2769.0.patch
>
>
> The bug is caught by one of the unit tests which fails.
> {noformat}
> Running org.apache.hadoop.yarn.applications.distributedshell.TestDistributedShell
> Tests run: 1, Failures: 1, Errors: 0, Skipped: 0, Time elapsed: 37.661 sec <<<
FAILURE! - in org.apache.hadoop.yarn.applications.distribut
> testDSShellWithDomain(org.apache.hadoop.yarn.applications.distributedshell.TestDistributedShell)
 Time elapsed: 37.366 sec  <<< FAILURE!
> org.junit.ComparisonFailure: expected:<[TEST_DOMAIN]> but was:<[DEFAULT]>
>         at org.junit.Assert.assertEquals(Assert.java:115)
>         at org.junit.Assert.assertEquals(Assert.java:144)
>         at org.apache.hadoop.yarn.applications.distributedshell.TestDistributedShell.testDSShell(TestDistributedShell.java:290)
>         at org.apache.hadoop.yarn.applications.distributedshell.TestDistributedShell.testDSShellWithDomain(TestDistributedShell.java:179)
> {noformat}



--
This message was sent by Atlassian JIRA
(v6.3.4#6332)

Mime
View raw message