hadoop-yarn-issues mailing list archives

Site index · List index
Message view « Date » · « Thread »
Top « Date » · « Thread »
From "Hadoop QA (JIRA)" <j...@apache.org>
Subject [jira] [Commented] (YARN-2747) TestAggregatedLogFormat fails in trunk
Date Sun, 26 Oct 2014 20:13:37 GMT

    [ https://issues.apache.org/jira/browse/YARN-2747?page=com.atlassian.jira.plugin.system.issuetabpanels:comment-tabpanel&focusedCommentId=14184656#comment-14184656
] 

Hadoop QA commented on YARN-2747:
---------------------------------

{color:green}+1 overall{color}.  Here are the results of testing the latest attachment 
  http://issues.apache.org/jira/secure/attachment/12677200/YARN-2747.1.patch
  against trunk revision 9ada928.

    {color:green}+1 @author{color}.  The patch does not contain any @author tags.

    {color:green}+1 tests included{color}.  The patch appears to include 1 new or modified
test files.

    {color:green}+1 javac{color}.  The applied patch does not increase the total number of
javac compiler warnings.

    {color:green}+1 javadoc{color}.  There were no new javadoc warning messages.

    {color:green}+1 eclipse:eclipse{color}.  The patch built with eclipse:eclipse.

    {color:green}+1 findbugs{color}.  The patch does not introduce any new Findbugs (version
2.0.3) warnings.

    {color:green}+1 release audit{color}.  The applied patch does not increase the total number
of release audit warnings.

    {color:green}+1 core tests{color}.  The patch passed unit tests in hadoop-yarn-project/hadoop-yarn/hadoop-yarn-common.

    {color:green}+1 contrib tests{color}.  The patch passed contrib unit tests.

Test results: https://builds.apache.org/job/PreCommit-YARN-Build/5572//testReport/
Console output: https://builds.apache.org/job/PreCommit-YARN-Build/5572//console

This message is automatically generated.

> TestAggregatedLogFormat fails in trunk
> --------------------------------------
>
>                 Key: YARN-2747
>                 URL: https://issues.apache.org/jira/browse/YARN-2747
>             Project: Hadoop YARN
>          Issue Type: Bug
>            Reporter: Xuan Gong
>            Assignee: Xuan Gong
>         Attachments: YARN-2747.1.patch
>
>
> Running org.apache.hadoop.yarn.logaggregation.TestAggregatedLogFormat
> Tests run: 3, Failures: 1, Errors: 0, Skipped: 0, Time elapsed: 1.105 sec <<<
FAILURE! - in org.apache.hadoop.yarn.logaggregation.TestAggregatedLogFormat
> testContainerLogsFileAccess(org.apache.hadoop.yarn.logaggregation.TestAggregatedLogFormat)
 Time elapsed: 0.047 sec  <<< FAILURE!
> java.lang.AssertionError: null
> 	at org.junit.Assert.fail(Assert.java:86)
> 	at org.junit.Assert.assertTrue(Assert.java:41)
> 	at org.junit.Assert.assertTrue(Assert.java:52)
> 	at org.apache.hadoop.yarn.logaggregation.TestAggregatedLogFormat.testContainerLogsFileAccess(TestAggregatedLogFormat.java:346)



--
This message was sent by Atlassian JIRA
(v6.3.4#6332)

Mime
View raw message