hadoop-yarn-issues mailing list archives

Site index · List index
Message view « Date » · « Thread »
Top « Date » · « Thread »
From "Xuan Gong (JIRA)" <j...@apache.org>
Subject [jira] [Updated] (YARN-2747) TestAggregatedLogFormat fails in trunk
Date Sun, 26 Oct 2014 19:33:34 GMT

     [ https://issues.apache.org/jira/browse/YARN-2747?page=com.atlassian.jira.plugin.system.issuetabpanels:all-tabpanel
]

Xuan Gong updated YARN-2747:
----------------------------
    Attachment: YARN-2747.1.patch

> TestAggregatedLogFormat fails in trunk
> --------------------------------------
>
>                 Key: YARN-2747
>                 URL: https://issues.apache.org/jira/browse/YARN-2747
>             Project: Hadoop YARN
>          Issue Type: Bug
>            Reporter: Xuan Gong
>            Assignee: Xuan Gong
>         Attachments: YARN-2747.1.patch
>
>
> Running org.apache.hadoop.yarn.logaggregation.TestAggregatedLogFormat
> Tests run: 3, Failures: 1, Errors: 0, Skipped: 0, Time elapsed: 1.105 sec <<<
FAILURE! - in org.apache.hadoop.yarn.logaggregation.TestAggregatedLogFormat
> testContainerLogsFileAccess(org.apache.hadoop.yarn.logaggregation.TestAggregatedLogFormat)
 Time elapsed: 0.047 sec  <<< FAILURE!
> java.lang.AssertionError: null
> 	at org.junit.Assert.fail(Assert.java:86)
> 	at org.junit.Assert.assertTrue(Assert.java:41)
> 	at org.junit.Assert.assertTrue(Assert.java:52)
> 	at org.apache.hadoop.yarn.logaggregation.TestAggregatedLogFormat.testContainerLogsFileAccess(TestAggregatedLogFormat.java:346)



--
This message was sent by Atlassian JIRA
(v6.3.4#6332)

Mime
View raw message