hadoop-yarn-issues mailing list archives

Site index · List index
Message view « Date » · « Thread »
Top « Date » · « Thread »
From "Hudson (JIRA)" <j...@apache.org>
Subject [jira] [Commented] (YARN-2584) TestContainerManagerSecurity fails on trunk
Date Tue, 23 Sep 2014 14:10:36 GMT

    [ https://issues.apache.org/jira/browse/YARN-2584?page=com.atlassian.jira.plugin.system.issuetabpanels:comment-tabpanel&focusedCommentId=14144816#comment-14144816
] 

Hudson commented on YARN-2584:
------------------------------

SUCCESS: Integrated in Hadoop-Hdfs-trunk #1880 (See [https://builds.apache.org/job/Hadoop-Hdfs-trunk/1880/])
YARN-2584. TestContainerManagerSecurity fails on trunk. (Contributed by Jian He) (junping_du:
rev a9a55db0650b5e6b7d88afb883b88aba7a13cd44)
* hadoop-yarn-project/hadoop-yarn/hadoop-yarn-server/hadoop-yarn-server-nodemanager/src/main/java/org/apache/hadoop/yarn/server/nodemanager/NodeStatusUpdaterImpl.java
* hadoop-yarn-project/CHANGES.txt
* hadoop-yarn-project/hadoop-yarn/hadoop-yarn-server/hadoop-yarn-server-tests/src/test/java/org/apache/hadoop/yarn/server/TestContainerManagerSecurity.java


> TestContainerManagerSecurity fails on trunk
> -------------------------------------------
>
>                 Key: YARN-2584
>                 URL: https://issues.apache.org/jira/browse/YARN-2584
>             Project: Hadoop YARN
>          Issue Type: Test
>            Reporter: Zhijie Shen
>            Assignee: Jian He
>             Fix For: 2.6.0
>
>         Attachments: YARN-2584.1.patch
>
>
> {code}
> Tests run: 4, Failures: 2, Errors: 0, Skipped: 0, Time elapsed: 561.964 sec <<<
FAILURE! - in org.apache.hadoop.yarn.server.TestContainerManagerSecurity
> testContainerManager[0](org.apache.hadoop.yarn.server.TestContainerManagerSecurity) 
Time elapsed: 259.553 sec  <<< FAILURE!
> java.lang.AssertionError: null
> 	at org.junit.Assert.fail(Assert.java:86)
> 	at org.junit.Assert.assertTrue(Assert.java:41)
> 	at org.junit.Assert.assertFalse(Assert.java:64)
> 	at org.junit.Assert.assertFalse(Assert.java:74)
> 	at org.apache.hadoop.yarn.server.TestContainerManagerSecurity.waitForContainerToFinishOnNM(TestContainerManagerSecurity.java:365)
> 	at org.apache.hadoop.yarn.server.TestContainerManagerSecurity.testNMTokens(TestContainerManagerSecurity.java:304)
> 	at org.apache.hadoop.yarn.server.TestContainerManagerSecurity.testContainerManager(TestContainerManagerSecurity.java:149)
> testContainerManager[1](org.apache.hadoop.yarn.server.TestContainerManagerSecurity) 
Time elapsed: 258.762 sec  <<< FAILURE!
> java.lang.AssertionError: null
> 	at org.junit.Assert.fail(Assert.java:86)
> 	at org.junit.Assert.assertTrue(Assert.java:41)
> 	at org.junit.Assert.assertFalse(Assert.java:64)
> 	at org.junit.Assert.assertFalse(Assert.java:74)
> 	at org.apache.hadoop.yarn.server.TestContainerManagerSecurity.waitForContainerToFinishOnNM(TestContainerManagerSecurity.java:365)
> 	at org.apache.hadoop.yarn.server.TestContainerManagerSecurity.testNMTokens(TestContainerManagerSecurity.java:304)
> 	at org.apache.hadoop.yarn.server.TestContainerManagerSecurity.testContainerManager(TestContainerManagerSecurity.java:149)
> {code}



--
This message was sent by Atlassian JIRA
(v6.3.4#6332)

Mime
View raw message