hadoop-yarn-issues mailing list archives

Site index · List index
Message view « Date » · « Thread »
Top « Date » · « Thread »
From "Hudson (JIRA)" <j...@apache.org>
Subject [jira] [Commented] (YARN-2452) TestRMApplicationHistoryWriter fails with FairScheduler
Date Mon, 22 Sep 2014 16:38:37 GMT

    [ https://issues.apache.org/jira/browse/YARN-2452?page=com.atlassian.jira.plugin.system.issuetabpanels:comment-tabpanel&focusedCommentId=14143387#comment-14143387
] 

Hudson commented on YARN-2452:
------------------------------

FAILURE: Integrated in Hadoop-Mapreduce-trunk #1904 (See [https://builds.apache.org/job/Hadoop-Mapreduce-trunk/1904/])
YARN-2452. TestRMApplicationHistoryWriter fails with FairScheduler. (Zhihai Xu via kasha)
(kasha: rev c50fc92502934aa2a8f84ea2466d4da1e3eace9d)
* hadoop-yarn-project/hadoop-yarn/hadoop-yarn-server/hadoop-yarn-server-resourcemanager/src/main/java/org/apache/hadoop/yarn/server/resourcemanager/scheduler/fair/FairSchedulerConfiguration.java
* hadoop-yarn-project/CHANGES.txt
* hadoop-yarn-project/hadoop-yarn/hadoop-yarn-server/hadoop-yarn-server-resourcemanager/src/test/java/org/apache/hadoop/yarn/server/resourcemanager/ahs/TestRMApplicationHistoryWriter.java


> TestRMApplicationHistoryWriter fails with FairScheduler
> -------------------------------------------------------
>
>                 Key: YARN-2452
>                 URL: https://issues.apache.org/jira/browse/YARN-2452
>             Project: Hadoop YARN
>          Issue Type: Bug
>            Reporter: zhihai xu
>            Assignee: zhihai xu
>             Fix For: 2.6.0
>
>         Attachments: YARN-2452.000.patch, YARN-2452.001.patch, YARN-2452.002.patch
>
>
> TestRMApplicationHistoryWriter is failed for FairScheduler. The failure is the following:
> T E S T S
> -------------------------------------------------------
> Running org.apache.hadoop.yarn.server.resourcemanager.ahs.TestRMApplicationHistoryWriter
> Tests run: 5, Failures: 1, Errors: 0, Skipped: 0, Time elapsed: 69.311 sec <<<
FAILURE! - in org.apache.hadoop.yarn.server.resourcemanager.ahs.TestRMApplicationHistoryWriter
> testRMWritingMassiveHistory(org.apache.hadoop.yarn.server.resourcemanager.ahs.TestRMApplicationHistoryWriter)
 Time elapsed: 66.261 sec  <<< FAILURE!
> java.lang.AssertionError: expected:<10000> but was:<200>
> 	at org.junit.Assert.fail(Assert.java:88)
> 	at org.junit.Assert.failNotEquals(Assert.java:743)
> 	at org.junit.Assert.assertEquals(Assert.java:118)
> 	at org.junit.Assert.assertEquals(Assert.java:555)
> 	at org.junit.Assert.assertEquals(Assert.java:542)
> 	at org.apache.hadoop.yarn.server.resourcemanager.ahs.TestRMApplicationHistoryWriter.testRMWritingMassiveHistory(TestRMApplicationHistoryWriter.java:430)
> 	at org.apache.hadoop.yarn.server.resourcemanager.ahs.TestRMApplicationHistoryWriter.testRMWritingMassiveHistory(TestRMApplicationHistoryWriter.java:391)



--
This message was sent by Atlassian JIRA
(v6.3.4#6332)

Mime
View raw message