hadoop-yarn-issues mailing list archives

Site index · List index
Message view « Date » · « Thread »
Top « Date » · « Thread »
From "Hadoop QA (JIRA)" <j...@apache.org>
Subject [jira] [Commented] (YARN-2452) TestRMApplicationHistoryWriter is failed for FairScheduler
Date Tue, 26 Aug 2014 05:48:58 GMT

    [ https://issues.apache.org/jira/browse/YARN-2452?page=com.atlassian.jira.plugin.system.issuetabpanels:comment-tabpanel&focusedCommentId=14110324#comment-14110324
] 

Hadoop QA commented on YARN-2452:
---------------------------------

{color:green}+1 overall{color}.  Here are the results of testing the latest attachment 
  http://issues.apache.org/jira/secure/attachment/12664310/YARN-2452.000.patch
  against trunk revision .

    {color:green}+1 @author{color}.  The patch does not contain any @author tags.

    {color:green}+1 tests included{color}.  The patch appears to include 1 new or modified
test files.

    {color:green}+1 javac{color}.  The applied patch does not increase the total number of
javac compiler warnings.

    {color:green}+1 javadoc{color}.  There were no new javadoc warning messages.

    {color:green}+1 eclipse:eclipse{color}.  The patch built with eclipse:eclipse.

    {color:green}+1 findbugs{color}.  The patch does not introduce any new Findbugs (version
2.0.3) warnings.

    {color:green}+1 release audit{color}.  The applied patch does not increase the total number
of release audit warnings.

    {color:green}+1 core tests{color}.  The patch passed unit tests in hadoop-yarn-project/hadoop-yarn/hadoop-yarn-server/hadoop-yarn-server-resourcemanager.

    {color:green}+1 contrib tests{color}.  The patch passed contrib unit tests.

Test results: https://builds.apache.org/job/PreCommit-YARN-Build/4730//testReport/
Console output: https://builds.apache.org/job/PreCommit-YARN-Build/4730//console

This message is automatically generated.

> TestRMApplicationHistoryWriter is failed for FairScheduler
> ----------------------------------------------------------
>
>                 Key: YARN-2452
>                 URL: https://issues.apache.org/jira/browse/YARN-2452
>             Project: Hadoop YARN
>          Issue Type: Bug
>            Reporter: zhihai xu
>            Assignee: zhihai xu
>         Attachments: YARN-2452.000.patch
>
>
> TestRMApplicationHistoryWriter is failed for FairScheduler. The failure is the following:
> T E S T S
> -------------------------------------------------------
> Running org.apache.hadoop.yarn.server.resourcemanager.ahs.TestRMApplicationHistoryWriter
> Tests run: 5, Failures: 1, Errors: 0, Skipped: 0, Time elapsed: 69.311 sec <<<
FAILURE! - in org.apache.hadoop.yarn.server.resourcemanager.ahs.TestRMApplicationHistoryWriter
> testRMWritingMassiveHistory(org.apache.hadoop.yarn.server.resourcemanager.ahs.TestRMApplicationHistoryWriter)
 Time elapsed: 66.261 sec  <<< FAILURE!
> java.lang.AssertionError: expected:<10000> but was:<200>
> 	at org.junit.Assert.fail(Assert.java:88)
> 	at org.junit.Assert.failNotEquals(Assert.java:743)
> 	at org.junit.Assert.assertEquals(Assert.java:118)
> 	at org.junit.Assert.assertEquals(Assert.java:555)
> 	at org.junit.Assert.assertEquals(Assert.java:542)
> 	at org.apache.hadoop.yarn.server.resourcemanager.ahs.TestRMApplicationHistoryWriter.testRMWritingMassiveHistory(TestRMApplicationHistoryWriter.java:430)
> 	at org.apache.hadoop.yarn.server.resourcemanager.ahs.TestRMApplicationHistoryWriter.testRMWritingMassiveHistory(TestRMApplicationHistoryWriter.java:391)



--
This message was sent by Atlassian JIRA
(v6.2#6252)

Mime
View raw message