hadoop-yarn-issues mailing list archives

Site index · List index
Message view « Date » · « Thread »
Top « Date » · « Thread »
From "zhihai xu (JIRA)" <j...@apache.org>
Subject [jira] [Created] (YARN-2452) TestRMApplicationHistoryWriter is failed for FairScheduler
Date Tue, 26 Aug 2014 01:09:58 GMT
zhihai xu created YARN-2452:
-------------------------------

             Summary: TestRMApplicationHistoryWriter is failed for FairScheduler
                 Key: YARN-2452
                 URL: https://issues.apache.org/jira/browse/YARN-2452
             Project: Hadoop YARN
          Issue Type: Bug
            Reporter: zhihai xu
            Assignee: zhihai xu


TestRMApplicationHistoryWriter is failed for FairScheduler. The failure is the following:
T E S T S
-------------------------------------------------------
Running org.apache.hadoop.yarn.server.resourcemanager.ahs.TestRMApplicationHistoryWriter
Tests run: 5, Failures: 1, Errors: 0, Skipped: 0, Time elapsed: 69.311 sec <<< FAILURE!
- in org.apache.hadoop.yarn.server.resourcemanager.ahs.TestRMApplicationHistoryWriter
testRMWritingMassiveHistory(org.apache.hadoop.yarn.server.resourcemanager.ahs.TestRMApplicationHistoryWriter)
 Time elapsed: 66.261 sec  <<< FAILURE!
java.lang.AssertionError: expected:<10000> but was:<200>
	at org.junit.Assert.fail(Assert.java:88)
	at org.junit.Assert.failNotEquals(Assert.java:743)
	at org.junit.Assert.assertEquals(Assert.java:118)
	at org.junit.Assert.assertEquals(Assert.java:555)
	at org.junit.Assert.assertEquals(Assert.java:542)
	at org.apache.hadoop.yarn.server.resourcemanager.ahs.TestRMApplicationHistoryWriter.testRMWritingMassiveHistory(TestRMApplicationHistoryWriter.java:430)
	at org.apache.hadoop.yarn.server.resourcemanager.ahs.TestRMApplicationHistoryWriter.testRMWritingMassiveHistory(TestRMApplicationHistoryWriter.java:391)





--
This message was sent by Atlassian JIRA
(v6.2#6252)

Mime
View raw message