hadoop-yarn-issues mailing list archives

Site index · List index
Message view « Date » · « Thread »
Top « Date » · « Thread »
From "Hadoop QA (JIRA)" <j...@apache.org>
Subject [jira] [Commented] (YARN-2270) TestFSDownload#testDownloadPublicWithStatCache fails in trunk
Date Tue, 15 Jul 2014 07:00:10 GMT

    [ https://issues.apache.org/jira/browse/YARN-2270?page=com.atlassian.jira.plugin.system.issuetabpanels:comment-tabpanel&focusedCommentId=14061777#comment-14061777
] 

Hadoop QA commented on YARN-2270:
---------------------------------

{color:green}+1 overall{color}.  Here are the results of testing the latest attachment 
  http://issues.apache.org/jira/secure/attachment/12655703/YARN-2270.patch
  against trunk revision .

    {color:green}+1 @author{color}.  The patch does not contain any @author tags.

    {color:green}+1 tests included{color}.  The patch appears to include 1 new or modified
test files.

    {color:green}+1 javac{color}.  The applied patch does not increase the total number of
javac compiler warnings.

    {color:green}+1 javadoc{color}.  There were no new javadoc warning messages.

    {color:green}+1 eclipse:eclipse{color}.  The patch built with eclipse:eclipse.

    {color:green}+1 findbugs{color}.  The patch does not introduce any new Findbugs (version
2.0.3) warnings.

    {color:green}+1 release audit{color}.  The applied patch does not increase the total number
of release audit warnings.

    {color:green}+1 core tests{color}.  The patch passed unit tests in hadoop-yarn-project/hadoop-yarn/hadoop-yarn-common.

    {color:green}+1 contrib tests{color}.  The patch passed contrib unit tests.

Test results: https://builds.apache.org/job/PreCommit-YARN-Build/4302//testReport/
Console output: https://builds.apache.org/job/PreCommit-YARN-Build/4302//console

This message is automatically generated.

> TestFSDownload#testDownloadPublicWithStatCache fails in trunk
> -------------------------------------------------------------
>
>                 Key: YARN-2270
>                 URL: https://issues.apache.org/jira/browse/YARN-2270
>             Project: Hadoop YARN
>          Issue Type: Test
>    Affects Versions: 2.4.1
>            Reporter: Ted Yu
>            Assignee: Akira AJISAKA
>            Priority: Minor
>         Attachments: YARN-2270.patch
>
>
> From https://builds.apache.org/job/Hadoop-yarn-trunk/608/console :
> {code}
> Running org.apache.hadoop.yarn.util.TestFSDownload
> Tests run: 9, Failures: 1, Errors: 0, Skipped: 0, Time elapsed: 1.955 sec <<<
FAILURE! - in org.apache.hadoop.yarn.util.TestFSDownload
> testDownloadPublicWithStatCache(org.apache.hadoop.yarn.util.TestFSDownload)  Time elapsed:
0.137 sec  <<< FAILURE!
> java.lang.AssertionError: null
> 	at org.junit.Assert.fail(Assert.java:86)
> 	at org.junit.Assert.assertTrue(Assert.java:41)
> 	at org.junit.Assert.assertTrue(Assert.java:52)
> 	at org.apache.hadoop.yarn.util.TestFSDownload.testDownloadPublicWithStatCache(TestFSDownload.java:363)
> {code}
> Similar error can be seen here: https://builds.apache.org/job/PreCommit-YARN-Build/4243//testReport/org.apache.hadoop.yarn.util/TestFSDownload/testDownloadPublicWithStatCache/
> Looks like future.get() returned null.



--
This message was sent by Atlassian JIRA
(v6.2#6252)

Mime
View raw message