hadoop-yarn-issues mailing list archives

Site index · List index
Message view « Date » · « Thread »
Top « Date » · « Thread »
From "Hudson (JIRA)" <j...@apache.org>
Subject [jira] [Commented] (YARN-2270) TestFSDownload#testDownloadPublicWithStatCache fails in trunk
Date Tue, 22 Jul 2014 05:04:39 GMT

    [ https://issues.apache.org/jira/browse/YARN-2270?page=com.atlassian.jira.plugin.system.issuetabpanels:comment-tabpanel&focusedCommentId=14069831#comment-14069831
] 

Hudson commented on YARN-2270:
------------------------------

FAILURE: Integrated in Hadoop-trunk-Commit #5932 (See [https://builds.apache.org/job/Hadoop-trunk-Commit/5932/])
YARN-2270. Made TestFSDownload#testDownloadPublicWithStatCache be skipped when there’s no
ancestor permissions. Contributed by Akira Ajisaka. (zjshen: http://svn.apache.org/viewcvs.cgi/?root=Apache-SVN&view=rev&rev=1612460)
* /hadoop/common/trunk/hadoop-yarn-project/CHANGES.txt
* /hadoop/common/trunk/hadoop-yarn-project/hadoop-yarn/hadoop-yarn-common/src/main/java/org/apache/hadoop/yarn/util/FSDownload.java
* /hadoop/common/trunk/hadoop-yarn-project/hadoop-yarn/hadoop-yarn-common/src/test/java/org/apache/hadoop/yarn/util/TestFSDownload.java


> TestFSDownload#testDownloadPublicWithStatCache fails in trunk
> -------------------------------------------------------------
>
>                 Key: YARN-2270
>                 URL: https://issues.apache.org/jira/browse/YARN-2270
>             Project: Hadoop YARN
>          Issue Type: Test
>    Affects Versions: 2.4.1
>            Reporter: Ted Yu
>            Assignee: Akira AJISAKA
>            Priority: Minor
>         Attachments: YARN-2270.2.patch, YARN-2270.patch
>
>
> From https://builds.apache.org/job/Hadoop-yarn-trunk/608/console :
> {code}
> Running org.apache.hadoop.yarn.util.TestFSDownload
> Tests run: 9, Failures: 1, Errors: 0, Skipped: 0, Time elapsed: 1.955 sec <<<
FAILURE! - in org.apache.hadoop.yarn.util.TestFSDownload
> testDownloadPublicWithStatCache(org.apache.hadoop.yarn.util.TestFSDownload)  Time elapsed:
0.137 sec  <<< FAILURE!
> java.lang.AssertionError: null
> 	at org.junit.Assert.fail(Assert.java:86)
> 	at org.junit.Assert.assertTrue(Assert.java:41)
> 	at org.junit.Assert.assertTrue(Assert.java:52)
> 	at org.apache.hadoop.yarn.util.TestFSDownload.testDownloadPublicWithStatCache(TestFSDownload.java:363)
> {code}
> Similar error can be seen here: https://builds.apache.org/job/PreCommit-YARN-Build/4243//testReport/org.apache.hadoop.yarn.util/TestFSDownload/testDownloadPublicWithStatCache/
> Looks like future.get() returned null.



--
This message was sent by Atlassian JIRA
(v6.2#6252)

Mime
View raw message