hadoop-yarn-issues mailing list archives

Site index · List index
Message view « Date » · « Thread »
Top « Date » · « Thread »
From "Hadoop QA (JIRA)" <j...@apache.org>
Subject [jira] [Commented] (YARN-1979) TestDirectoryCollection fails when the umask is unusual
Date Tue, 29 Jul 2014 02:53:38 GMT

    [ https://issues.apache.org/jira/browse/YARN-1979?page=com.atlassian.jira.plugin.system.issuetabpanels:comment-tabpanel&focusedCommentId=14077319#comment-14077319
] 

Hadoop QA commented on YARN-1979:
---------------------------------

{color:green}+1 overall{color}.  Here are the results of testing the latest attachment 
  http://issues.apache.org/jira/secure/attachment/12658331/YARN-1979.2.patch
  against trunk revision .

    {color:green}+1 @author{color}.  The patch does not contain any @author tags.

    {color:green}+1 tests included{color}.  The patch appears to include 1 new or modified
test files.

    {color:green}+1 javac{color}.  The applied patch does not increase the total number of
javac compiler warnings.

    {color:green}+1 javadoc{color}.  There were no new javadoc warning messages.

    {color:green}+1 eclipse:eclipse{color}.  The patch built with eclipse:eclipse.

    {color:green}+1 findbugs{color}.  The patch does not introduce any new Findbugs (version
2.0.3) warnings.

    {color:green}+1 release audit{color}.  The applied patch does not increase the total number
of release audit warnings.

    {color:green}+1 core tests{color}.  The patch passed unit tests in hadoop-yarn-project/hadoop-yarn/hadoop-yarn-server/hadoop-yarn-server-nodemanager.

    {color:green}+1 contrib tests{color}.  The patch passed contrib unit tests.

Test results: https://builds.apache.org/job/PreCommit-YARN-Build/4465//testReport/
Console output: https://builds.apache.org/job/PreCommit-YARN-Build/4465//console

This message is automatically generated.

> TestDirectoryCollection fails when the umask is unusual
> -------------------------------------------------------
>
>                 Key: YARN-1979
>                 URL: https://issues.apache.org/jira/browse/YARN-1979
>             Project: Hadoop YARN
>          Issue Type: Test
>            Reporter: Vinod Kumar Vavilapalli
>            Assignee: Vinod Kumar Vavilapalli
>         Attachments: YARN-1979.2.patch, YARN-1979.txt
>
>
> I've seen this fail in Windows where the default permissions are matching up to 700.
> {code}
> -------------------------------------------------------------------------------
> Test set: org.apache.hadoop.yarn.server.nodemanager.TestDirectoryCollection
> -------------------------------------------------------------------------------
> Tests run: 5, Failures: 1, Errors: 0, Skipped: 0, Time elapsed: 1.015 sec <<<
FAILURE! - in org.apache.hadoop.yarn.server.nodemanager.TestDirectoryCollection
> testCreateDirectories(org.apache.hadoop.yarn.server.nodemanager.TestDirectoryCollection)
 Time elapsed: 0.422 sec  <<< FAILURE!
> java.lang.AssertionError: local dir parent Y:\hadoop-yarn-project\hadoop-yarn\hadoop-yarn-server\hadoop-yarn-server-nodemanager\target\org.apache.hadoop.yarn.server.nodemanager.TestDirectoryCollection\dirA
not created with proper permissions expected:<rwxr-xr-x> but was:<rwx------>
>         at org.junit.Assert.fail(Assert.java:93)
>         at org.junit.Assert.failNotEquals(Assert.java:647)
>         at org.junit.Assert.assertEquals(Assert.java:128)
>         at org.apache.hadoop.yarn.server.nodemanager.TestDirectoryCollection.testCreateDirectories(TestDirectoryCollection.java:106)
> {code}
> The clash is between testDiskSpaceUtilizationLimit() and testCreateDirectories().



--
This message was sent by Atlassian JIRA
(v6.2#6252)

Mime
View raw message