hadoop-yarn-issues mailing list archives

Site index · List index
Message view « Date » · « Thread »
Top « Date » · « Thread »
From "Hadoop QA (JIRA)" <j...@apache.org>
Subject [jira] [Commented] (YARN-2075) TestRMAdminCLI consistently fail on trunk
Date Tue, 20 May 2014 09:56:40 GMT

    [ https://issues.apache.org/jira/browse/YARN-2075?page=com.atlassian.jira.plugin.system.issuetabpanels:comment-tabpanel&focusedCommentId=14003027#comment-14003027
] 

Hadoop QA commented on YARN-2075:
---------------------------------

{color:green}+1 overall{color}.  Here are the results of testing the latest attachment 
  http://issues.apache.org/jira/secure/attachment/12645730/YARN-2075.patch
  against trunk revision .

    {color:green}+1 @author{color}.  The patch does not contain any @author tags.

    {color:green}+1 tests included{color}.  The patch appears to include 1 new or modified
test files.

    {color:green}+1 javac{color}.  The applied patch does not increase the total number of
javac compiler warnings.

    {color:green}+1 javadoc{color}.  There were no new javadoc warning messages.

    {color:green}+1 eclipse:eclipse{color}.  The patch built with eclipse:eclipse.

    {color:green}+1 findbugs{color}.  The patch does not introduce any new Findbugs (version
1.3.9) warnings.

    {color:green}+1 release audit{color}.  The applied patch does not increase the total number
of release audit warnings.

    {color:green}+1 core tests{color}.  The patch passed unit tests in hadoop-common-project/hadoop-common
hadoop-yarn-project/hadoop-yarn/hadoop-yarn-client.

    {color:green}+1 contrib tests{color}.  The patch passed contrib unit tests.

Test results: https://builds.apache.org/job/PreCommit-YARN-Build/3769//testReport/
Console output: https://builds.apache.org/job/PreCommit-YARN-Build/3769//console

This message is automatically generated.

> TestRMAdminCLI consistently fail on trunk
> -----------------------------------------
>
>                 Key: YARN-2075
>                 URL: https://issues.apache.org/jira/browse/YARN-2075
>             Project: Hadoop YARN
>          Issue Type: Bug
>            Reporter: Zhijie Shen
>         Attachments: YARN-2075.patch
>
>
> {code}
> Running org.apache.hadoop.yarn.client.TestRMAdminCLI
> Tests run: 13, Failures: 1, Errors: 1, Skipped: 0, Time elapsed: 1.191 sec <<<
FAILURE! - in org.apache.hadoop.yarn.client.TestRMAdminCLI
> testTransitionToActive(org.apache.hadoop.yarn.client.TestRMAdminCLI)  Time elapsed: 0.082
sec  <<< ERROR!
> java.lang.UnsupportedOperationException: null
> 	at java.util.AbstractList.remove(AbstractList.java:144)
> 	at java.util.AbstractList$Itr.remove(AbstractList.java:360)
> 	at java.util.AbstractCollection.remove(AbstractCollection.java:252)
> 	at org.apache.hadoop.ha.HAAdmin.isOtherTargetNodeActive(HAAdmin.java:173)
> 	at org.apache.hadoop.ha.HAAdmin.transitionToActive(HAAdmin.java:144)
> 	at org.apache.hadoop.ha.HAAdmin.runCmd(HAAdmin.java:447)
> 	at org.apache.hadoop.ha.HAAdmin.run(HAAdmin.java:380)
> 	at org.apache.hadoop.yarn.client.cli.RMAdminCLI.run(RMAdminCLI.java:318)
> 	at org.apache.hadoop.yarn.client.TestRMAdminCLI.testTransitionToActive(TestRMAdminCLI.java:180)
> testHelp(org.apache.hadoop.yarn.client.TestRMAdminCLI)  Time elapsed: 0.088 sec  <<<
FAILURE!
> java.lang.AssertionError: null
> 	at org.junit.Assert.fail(Assert.java:86)
> 	at org.junit.Assert.assertTrue(Assert.java:41)
> 	at org.junit.Assert.assertTrue(Assert.java:52)
> 	at org.apache.hadoop.yarn.client.TestRMAdminCLI.testError(TestRMAdminCLI.java:366)
> 	at org.apache.hadoop.yarn.client.TestRMAdminCLI.testHelp(TestRMAdminCLI.java:307)
> {code}



--
This message was sent by Atlassian JIRA
(v6.2#6252)

Mime
View raw message