hadoop-yarn-issues mailing list archives

Site index · List index
Message view « Date » · « Thread »
Top « Date » · « Thread »
From "Hudson (JIRA)" <j...@apache.org>
Subject [jira] [Commented] (YARN-1201) TestAMAuthorization fails with local hostname cannot be resolved
Date Sun, 04 May 2014 20:09:21 GMT

    [ https://issues.apache.org/jira/browse/YARN-1201?page=com.atlassian.jira.plugin.system.issuetabpanels:comment-tabpanel&focusedCommentId=13989118#comment-13989118
] 

Hudson commented on YARN-1201:
------------------------------

SUCCESS: Integrated in Hadoop-trunk-Commit #5591 (See [https://builds.apache.org/job/Hadoop-trunk-Commit/5591/])
YARN-1201. TestAMAuthorization fails with local hostname cannot be resolved. (Wangda Tan via
junping_du) (junping_du: http://svn.apache.org/viewcvs.cgi/?root=Apache-SVN&view=rev&rev=1592197)
* /hadoop/common/trunk/hadoop-yarn-project/CHANGES.txt
* /hadoop/common/trunk/hadoop-yarn-project/hadoop-yarn/hadoop-yarn-server/hadoop-yarn-server-resourcemanager/src/test/java/org/apache/hadoop/yarn/server/resourcemanager/TestAMAuthorization.java


> TestAMAuthorization fails with local hostname cannot be resolved
> ----------------------------------------------------------------
>
>                 Key: YARN-1201
>                 URL: https://issues.apache.org/jira/browse/YARN-1201
>             Project: Hadoop YARN
>          Issue Type: Bug
>          Components: resourcemanager
>    Affects Versions: 2.1.0-beta
>         Environment: SUSE Linux Enterprise Server 11 (x86_64)
>            Reporter: Nemon Lou
>            Assignee: Wangda Tan
>            Priority: Minor
>             Fix For: 2.4.1
>
>         Attachments: YARN-1201.patch, YARN-1201.patch, YARN-1201.patch, YARN-1201.patch,
YARN-1201.patch, YARN-1201.patch, YARN-1201.patch
>
>
> When hostname is 158-1-131-10, TestAMAuthorization fails.
> {code}
> Running org.apache.hadoop.yarn.server.resourcemanager.TestAMAuthorization
> Tests run: 4, Failures: 0, Errors: 2, Skipped: 0, Time elapsed: 14.034 sec <<<
FAILURE! - in org.apache.hadoop.yarn.server.resourcemanager.TestAMAuthorization
> testUnauthorizedAccess[0](org.apache.hadoop.yarn.server.resourcemanager.TestAMAuthorization)
 Time elapsed: 3.952 sec  <<< ERROR!
> java.lang.NullPointerException: null
>         at org.apache.hadoop.yarn.server.resourcemanager.TestAMAuthorization.testUnauthorizedAccess(TestAMAuthorization.java:284)
> testUnauthorizedAccess[1](org.apache.hadoop.yarn.server.resourcemanager.TestAMAuthorization)
 Time elapsed: 3.116 sec  <<< ERROR!
> java.lang.NullPointerException: null
>         at org.apache.hadoop.yarn.server.resourcemanager.TestAMAuthorization.testUnauthorizedAccess(TestAMAuthorization.java:284)
> Results :
> Tests in error:
>   TestAMAuthorization.testUnauthorizedAccess:284 NullPointer
>   TestAMAuthorization.testUnauthorizedAccess:284 NullPointer
> Tests run: 4, Failures: 0, Errors: 2, Skipped: 0
> {code}



--
This message was sent by Atlassian JIRA
(v6.2#6252)

Mime
View raw message