hadoop-yarn-issues mailing list archives

Site index · List index
Message view « Date » · « Thread »
Top « Date » · « Thread »
From "Hadoop QA (JIRA)" <j...@apache.org>
Subject [jira] [Commented] (YARN-1201) TestAMAuthorization fails with local hostname cannot be resolved
Date Fri, 02 May 2014 09:17:16 GMT

    [ https://issues.apache.org/jira/browse/YARN-1201?page=com.atlassian.jira.plugin.system.issuetabpanels:comment-tabpanel&focusedCommentId=13987525#comment-13987525
] 

Hadoop QA commented on YARN-1201:
---------------------------------

{color:red}-1 overall{color}.  Here are the results of testing the latest attachment 
  http://issues.apache.org/jira/secure/attachment/12643011/YARN-1201.patch
  against trunk revision .

    {color:green}+1 @author{color}.  The patch does not contain any @author tags.

    {color:green}+1 tests included{color}.  The patch appears to include 1 new or modified
test files.

    {color:green}+1 javac{color}.  The applied patch does not increase the total number of
javac compiler warnings.

    {color:green}+1 javadoc{color}.  There were no new javadoc warning messages.

    {color:green}+1 eclipse:eclipse{color}.  The patch built with eclipse:eclipse.

    {color:green}+1 findbugs{color}.  The patch does not introduce any new Findbugs (version
1.3.9) warnings.

    {color:green}+1 release audit{color}.  The applied patch does not increase the total number
of release audit warnings.

    {color:red}-1 core tests{color}.  The patch failed these unit tests in hadoop-yarn-project/hadoop-yarn/hadoop-yarn-server/hadoop-yarn-server-resourcemanager:

                  org.apache.hadoop.yarn.server.resourcemanager.TestRMRestart

    {color:green}+1 contrib tests{color}.  The patch passed contrib unit tests.

Test results: https://builds.apache.org/job/PreCommit-YARN-Build/3678//testReport/
Console output: https://builds.apache.org/job/PreCommit-YARN-Build/3678//console

This message is automatically generated.

> TestAMAuthorization fails with local hostname cannot be resolved
> ----------------------------------------------------------------
>
>                 Key: YARN-1201
>                 URL: https://issues.apache.org/jira/browse/YARN-1201
>             Project: Hadoop YARN
>          Issue Type: Bug
>          Components: resourcemanager
>    Affects Versions: 2.1.0-beta
>         Environment: SUSE Linux Enterprise Server 11 (x86_64)
>            Reporter: Nemon Lou
>            Assignee: Wangda Tan
>            Priority: Minor
>         Attachments: YARN-1201.patch, YARN-1201.patch, YARN-1201.patch, YARN-1201.patch
>
>
> When hostname is 158-1-131-10, TestAMAuthorization fails.
> {code}
> Running org.apache.hadoop.yarn.server.resourcemanager.TestAMAuthorization
> Tests run: 4, Failures: 0, Errors: 2, Skipped: 0, Time elapsed: 14.034 sec <<<
FAILURE! - in org.apache.hadoop.yarn.server.resourcemanager.TestAMAuthorization
> testUnauthorizedAccess[0](org.apache.hadoop.yarn.server.resourcemanager.TestAMAuthorization)
 Time elapsed: 3.952 sec  <<< ERROR!
> java.lang.NullPointerException: null
>         at org.apache.hadoop.yarn.server.resourcemanager.TestAMAuthorization.testUnauthorizedAccess(TestAMAuthorization.java:284)
> testUnauthorizedAccess[1](org.apache.hadoop.yarn.server.resourcemanager.TestAMAuthorization)
 Time elapsed: 3.116 sec  <<< ERROR!
> java.lang.NullPointerException: null
>         at org.apache.hadoop.yarn.server.resourcemanager.TestAMAuthorization.testUnauthorizedAccess(TestAMAuthorization.java:284)
> Results :
> Tests in error:
>   TestAMAuthorization.testUnauthorizedAccess:284 NullPointer
>   TestAMAuthorization.testUnauthorizedAccess:284 NullPointer
> Tests run: 4, Failures: 0, Errors: 2, Skipped: 0
> {code}



--
This message was sent by Atlassian JIRA
(v6.2#6252)

Mime
View raw message