hadoop-yarn-issues mailing list archives

Site index · List index
Message view « Date » · « Thread »
Top « Date » · « Thread »
From "Junping Du (JIRA)" <j...@apache.org>
Subject [jira] [Commented] (YARN-1201) TestAMAuthorization fails with local hostname cannot be resolved
Date Thu, 01 May 2014 14:48:16 GMT

    [ https://issues.apache.org/jira/browse/YARN-1201?page=com.atlassian.jira.plugin.system.issuetabpanels:comment-tabpanel&focusedCommentId=13986644#comment-13986644
] 

Junping Du commented on YARN-1201:
----------------------------------

Thanks [~leftnoteasy] for identifying the root cause and delivering a patch here. However,
I don't think we should fix test here as test code itself is fine to me. We'd better to throw
an exception with meaningful message rather than NPE when local hostname cannot be resolved.
So I move this from test to bug.

> TestAMAuthorization fails with local hostname cannot be resolved
> ----------------------------------------------------------------
>
>                 Key: YARN-1201
>                 URL: https://issues.apache.org/jira/browse/YARN-1201
>             Project: Hadoop YARN
>          Issue Type: Bug
>          Components: resourcemanager
>    Affects Versions: 2.1.0-beta
>         Environment: SUSE Linux Enterprise Server 11 (x86_64)
>            Reporter: Nemon Lou
>            Assignee: Wangda Tan
>            Priority: Minor
>         Attachments: YARN-1201.patch
>
>
> When hostname is 158-1-131-10, TestAMAuthorization fails.
> {code}
> Running org.apache.hadoop.yarn.server.resourcemanager.TestAMAuthorization
> Tests run: 4, Failures: 0, Errors: 2, Skipped: 0, Time elapsed: 14.034 sec <<<
FAILURE! - in org.apache.hadoop.yarn.server.resourcemanager.TestAMAuthorization
> testUnauthorizedAccess[0](org.apache.hadoop.yarn.server.resourcemanager.TestAMAuthorization)
 Time elapsed: 3.952 sec  <<< ERROR!
> java.lang.NullPointerException: null
>         at org.apache.hadoop.yarn.server.resourcemanager.TestAMAuthorization.testUnauthorizedAccess(TestAMAuthorization.java:284)
> testUnauthorizedAccess[1](org.apache.hadoop.yarn.server.resourcemanager.TestAMAuthorization)
 Time elapsed: 3.116 sec  <<< ERROR!
> java.lang.NullPointerException: null
>         at org.apache.hadoop.yarn.server.resourcemanager.TestAMAuthorization.testUnauthorizedAccess(TestAMAuthorization.java:284)
> Results :
> Tests in error:
>   TestAMAuthorization.testUnauthorizedAccess:284 NullPointer
>   TestAMAuthorization.testUnauthorizedAccess:284 NullPointer
> Tests run: 4, Failures: 0, Errors: 2, Skipped: 0
> {code}



--
This message was sent by Atlassian JIRA
(v6.2#6252)

Mime
View raw message