hadoop-yarn-issues mailing list archives

Site index · List index
Message view « Date » · « Thread »
Top « Date » · « Thread »
From "Hudson (JIRA)" <j...@apache.org>
Subject [jira] [Commented] (YARN-738) TestClientRMTokens is failing irregularly while running all yarn tests
Date Wed, 30 Apr 2014 15:36:18 GMT

    [ https://issues.apache.org/jira/browse/YARN-738?page=com.atlassian.jira.plugin.system.issuetabpanels:comment-tabpanel&focusedCommentId=13985630#comment-13985630
] 

Hudson commented on YARN-738:
-----------------------------

FAILURE: Integrated in Hadoop-Mapreduce-trunk #1773 (See [https://builds.apache.org/job/Hadoop-Mapreduce-trunk/1773/])
YARN-738. TestClientRMTokens is failing irregularly while running all yarn tests. Contributed
by Ming Ma (jlowe: http://svn.apache.org/viewcvs.cgi/?root=Apache-SVN&view=rev&rev=1591030)
* /hadoop/common/trunk/hadoop-yarn-project/CHANGES.txt
* /hadoop/common/trunk/hadoop-yarn-project/hadoop-yarn/hadoop-yarn-server/hadoop-yarn-server-resourcemanager/src/test/java/org/apache/hadoop/yarn/server/resourcemanager/TestClientRMTokens.java


> TestClientRMTokens is failing irregularly while running all yarn tests
> ----------------------------------------------------------------------
>
>                 Key: YARN-738
>                 URL: https://issues.apache.org/jira/browse/YARN-738
>             Project: Hadoop YARN
>          Issue Type: Bug
>            Reporter: Omkar Vinit Joshi
>            Assignee: Ming Ma
>             Fix For: 3.0.0, 2.5.0
>
>         Attachments: YARN-738.patch
>
>
> Running org.apache.hadoop.yarn.server.resourcemanager.TestClientRMTokens
> Tests run: 6, Failures: 0, Errors: 1, Skipped: 0, Time elapsed: 16.787 sec <<<
FAILURE!
> testShortCircuitRenewCancel(org.apache.hadoop.yarn.server.resourcemanager.TestClientRMTokens)
 Time elapsed: 186 sec  <<< ERROR!
> java.lang.RuntimeException: getProxy
> 	at org.apache.hadoop.yarn.server.resourcemanager.TestClientRMTokens$YarnBadRPC.getProxy(TestClientRMTokens.java:334)
> 	at org.apache.hadoop.yarn.security.client.RMDelegationTokenIdentifier$Renewer.getRmClient(RMDelegationTokenIdentifier.java:157)
> 	at org.apache.hadoop.yarn.security.client.RMDelegationTokenIdentifier$Renewer.renew(RMDelegationTokenIdentifier.java:102)
> 	at org.apache.hadoop.security.token.Token.renew(Token.java:372)
> 	at org.apache.hadoop.yarn.server.resourcemanager.TestClientRMTokens.checkShortCircuitRenewCancel(TestClientRMTokens.java:306)
> 	at org.apache.hadoop.yarn.server.resourcemanager.TestClientRMTokens.testShortCircuitRenewCancel(TestClientRMTokens.java:240)
> 	at sun.reflect.NativeMethodAccessorImpl.invoke0(Native Method)
> 	at sun.reflect.NativeMethodAccessorImpl.invoke(NativeMethodAccessorImpl.java:39)
> 	at sun.reflect.DelegatingMethodAccessorImpl.invoke(DelegatingMethodAccessorImpl.java:25)
> 	at java.lang.reflect.Method.invoke(Method.java:597)
> 	at org.junit.runners.model.FrameworkMethod$1.runReflectiveCall(FrameworkMethod.java:45)
> 	at org.junit.internal.runners.model.ReflectiveCallable.run(ReflectiveCallable.java:15)
> 	at org.junit.runners.model.FrameworkMethod.invokeExplosively(FrameworkMethod.java:42)
> 	at org.junit.internal.runners.statements.InvokeMethod.evaluate(InvokeMethod.java:20)
> 	at org.junit.internal.runners.statements.RunBefores.evaluate(RunBefores.java:28)
> 	at org.junit.runners.ParentRunner.runLeaf(ParentRunner.java:263)
> 	at org.junit.runners.BlockJUnit4ClassRunner.runChild(BlockJUnit4ClassRunner.java:68)
> 	at org.junit.runners.BlockJUnit4ClassRunner.runChild(BlockJUnit4ClassRunner.java:47)
> 	at org.junit.runners.ParentRunner$3.run(ParentRunner.java:231)
> 	at org.junit.runners.ParentRunner$1.schedule(ParentRunner.java:60)
> 	at org.junit.runners.ParentRunner.runChildren(ParentRunner.java:229)
> 	at org.junit.runners.ParentRunner.access$000(ParentRunner.java:50)
> 	at org.junit.runners.ParentRunner$2.evaluate(ParentRunner.java:222)
> 	at org.junit.runners.ParentRunner.run(ParentRunner.java:300)
> 	at org.apache.maven.surefire.junit4.JUnit4Provider.execute(JUnit4Provider.java:252)
> 	at org.apache.maven.surefire.junit4.JUnit4Provider.executeTestSet(JUnit4Provider.java:141)
> 	at org.apache.maven.surefire.junit4.JUnit4Provider.invoke(JUnit4Provider.java:112)
> 	at sun.reflect.NativeMethodAccessorImpl.invoke0(Native Method)
> 	at sun.reflect.NativeMethodAccessorImpl.invoke(NativeMethodAccessorImpl.java:39)
> 	at sun.reflect.DelegatingMethodAccessorImpl.invoke(DelegatingMethodAccessorImpl.java:25)
> 	at java.lang.reflect.Method.invoke(Method.java:597)
> 	at org.apache.maven.surefire.util.ReflectionUtils.invokeMethodWithArray(ReflectionUtils.java:189)
> 	at org.apache.maven.surefire.booter.ProviderFactory$ProviderProxy.invoke(ProviderFactory.java:165)
> 	at org.apache.maven.surefire.booter.ProviderFactory.invokeProvider(ProviderFactory.java:85)
> 	at org.apache.maven.surefire.booter.ForkedBooter.runSuitesInProcess(ForkedBooter.java:115)
> 	at org.apache.maven.surefire.booter.ForkedBooter.main(ForkedBooter.java:75)



--
This message was sent by Atlassian JIRA
(v6.2#6252)

Mime
View raw message