hadoop-yarn-issues mailing list archives

Site index · List index
Message view « Date » · « Thread »
Top « Date » · « Thread »
From "Hadoop QA (JIRA)" <j...@apache.org>
Subject [jira] [Commented] (YARN-1873) TestDistributedShell#testDSShell fails
Date Wed, 26 Mar 2014 15:41:15 GMT

    [ https://issues.apache.org/jira/browse/YARN-1873?page=com.atlassian.jira.plugin.system.issuetabpanels:comment-tabpanel&focusedCommentId=13948010#comment-13948010
] 

Hadoop QA commented on YARN-1873:
---------------------------------

{color:green}+1 overall{color}.  Here are the results of testing the latest attachment 
  http://issues.apache.org/jira/secure/attachment/12636931/YARN-1873.patch
  against trunk revision .

    {color:green}+1 @author{color}.  The patch does not contain any @author tags.

    {color:green}+1 tests included{color}.  The patch appears to include 1 new or modified
test files.

    {color:green}+1 javac{color}.  The applied patch does not increase the total number of
javac compiler warnings.

    {color:green}+1 javadoc{color}.  There were no new javadoc warning messages.

    {color:green}+1 eclipse:eclipse{color}.  The patch built with eclipse:eclipse.

    {color:green}+1 findbugs{color}.  The patch does not introduce any new Findbugs (version
1.3.9) warnings.

    {color:green}+1 release audit{color}.  The applied patch does not increase the total number
of release audit warnings.

    {color:green}+1 core tests{color}.  The patch passed unit tests in hadoop-yarn-project/hadoop-yarn/hadoop-yarn-applications/hadoop-yarn-applications-distributedshell.

    {color:green}+1 contrib tests{color}.  The patch passed contrib unit tests.

Test results: https://builds.apache.org/job/PreCommit-YARN-Build/3464//testReport/
Console output: https://builds.apache.org/job/PreCommit-YARN-Build/3464//console

This message is automatically generated.

> TestDistributedShell#testDSShell fails
> --------------------------------------
>
>                 Key: YARN-1873
>                 URL: https://issues.apache.org/jira/browse/YARN-1873
>             Project: Hadoop YARN
>          Issue Type: Bug
>    Affects Versions: 3.0.0, 2.4.0
>            Reporter: Mit Desai
>            Assignee: Mit Desai
>             Fix For: 3.0.0, 2.5.0
>
>         Attachments: YARN-1873.patch, YARN-1873.patch, YARN-1873.patch
>
>
> testDSShell fails when the tests are run in random order. I see a cleanup issue here.
> {noformat}
> Tests run: 1, Failures: 1, Errors: 0, Skipped: 0, Time elapsed: 72.222 sec <<<
FAILURE! - in org.apache.hadoop.yarn.applications.distributedshell.TestDistributedShell
> testOrder(org.apache.hadoop.yarn.applications.distributedshell.TestDistributedShell)
 Time elapsed: 44.127 sec  <<< FAILURE!
> java.lang.AssertionError: expected:<1> but was:<6>
> 	at org.junit.Assert.fail(Assert.java:93)
> 	at org.junit.Assert.failNotEquals(Assert.java:647)
> 	at org.junit.Assert.assertEquals(Assert.java:128)
> 	at org.junit.Assert.assertEquals(Assert.java:472)
> 	at org.junit.Assert.assertEquals(Assert.java:456)
> 	at org.apache.hadoop.yarn.applications.distributedshell.TestDistributedShell.testDSShell(TestDistributedShell.java:204)
> 	at org.apache.hadoop.yarn.applications.distributedshell.TestDistributedShell.testOrder(TestDistributedShell.java:134)
> Results :
> Failed tests: 
>   TestDistributedShell.testOrder:134->testDSShell:204 expected:<1> but was:<6>
> {noformat}
> The Line numbers will be little deviated because I was trying to reproduce the error
by running the tests in specific order. But the Line that causes the assert fail is {{Assert.assertEquals(1,
entitiesAttempts.getEntities().size());}}



--
This message was sent by Atlassian JIRA
(v6.2#6252)

Mime
View raw message