hadoop-yarn-issues mailing list archives

Site index · List index
Message view « Date » · « Thread »
Top « Date » · « Thread »
From "Vinod Kumar Vavilapalli (JIRA)" <j...@apache.org>
Subject [jira] [Updated] (YARN-1863) TestRMFailover fails with 'AssertionError: null'
Date Sat, 22 Mar 2014 00:22:43 GMT

     [ https://issues.apache.org/jira/browse/YARN-1863?page=com.atlassian.jira.plugin.system.issuetabpanels:all-tabpanel
]

Vinod Kumar Vavilapalli updated YARN-1863:
------------------------------------------

    Assignee: Xuan Gong  (was: Vinod Kumar Vavilapalli)
     Summary: TestRMFailover fails with 'AssertionError: null'   (was: Several YARN test failures
on trunk)

Okay, I cannot reproduce any more test failures on linux and Mac. Re-editing the title and
assigning back to Xuan.

Checking this in for now.

> TestRMFailover fails with 'AssertionError: null' 
> -------------------------------------------------
>
>                 Key: YARN-1863
>                 URL: https://issues.apache.org/jira/browse/YARN-1863
>             Project: Hadoop YARN
>          Issue Type: Test
>            Reporter: Ted Yu
>            Assignee: Xuan Gong
>            Priority: Blocker
>         Attachments: YARN-1863.1.patch, YARN-1863.2.patch
>
>
> This happened in Hadoop-Yarn-trunk - Build # 516 and can be reproduced:
> {code}
> testWebAppProxyInStandAloneMode(org.apache.hadoop.yarn.client.TestRMFailover)  Time elapsed:
5.834 sec  <<< FAILURE!
> java.lang.AssertionError: null
> 	at org.junit.Assert.fail(Assert.java:92)
> 	at org.junit.Assert.assertTrue(Assert.java:43)
> 	at org.junit.Assert.assertTrue(Assert.java:54)
> 	at org.apache.hadoop.yarn.client.TestRMFailover.verifyExpectedException(TestRMFailover.java:250)
> 	at org.apache.hadoop.yarn.client.TestRMFailover.testWebAppProxyInStandAloneMode(TestRMFailover.java:216)
> testEmbeddedWebAppProxy(org.apache.hadoop.yarn.client.TestRMFailover)  Time elapsed:
5.341 sec  <<< FAILURE!
> java.lang.AssertionError: null
> 	at org.junit.Assert.fail(Assert.java:92)
> 	at org.junit.Assert.assertTrue(Assert.java:43)
> 	at org.junit.Assert.assertTrue(Assert.java:54)
> 	at org.apache.hadoop.yarn.client.TestRMFailover.verifyExpectedException(TestRMFailover.java:250)
> 	at org.apache.hadoop.yarn.client.TestRMFailover.testEmbeddedWebAppProxy(TestRMFailover.java:241)
> {code}



--
This message was sent by Atlassian JIRA
(v6.2#6252)

Mime
View raw message